FAQ
See <http://perl5.git.perl.org:8080/job/perl5-win32/2434/changes>

Changes:

[khw] Pod::Functions/Functions_pm.PL: Fix pod error

[khw] PathTools: fix Pod::Checker warning for pod

[khw] ExtUtils::ParseXS: Silence some pod warnings

------------------------------------------
[...truncated 2297 lines...]

  C:\jenkins\workspace\perl5-win32\miniperl.exe "-I..\..\lib" -MExtUtils::Command -e chmod -- 755 ..\..\lib\auto\Win32CORE\Win32CORE.lib
  ..\miniperl.exe -I..\lib list_static_libs.pl > Extensions_static
  link -dll -def:perldll.def -base:0x28000000 -out:..\perl525.dll @Extensions_static @C:\Windows\TEMP\nm9C47.tmp
    Creating library ..\perl525.lib and object ..\perl525.exp
Generating code
Finished generating code
  if exist ..\perl525.dll.manifest mt -nologo -manifest ..\perl525.dll.manifest -outputresource:..\perl525.dll;2 && if exist ..\perl525.dll.manifest del ..\perl525.dll.manifest
  xcopy /f /r /i /d /y ..\perl525.lib ..\lib\CORE
C:\jenkins\workspace\perl5-win32\perl525.lib -> C:\jenkins\workspace\perl5-win32\lib\CORE\perl525.lib
1 File(s) copied
  copy runperl.c perlmain.c
         1 file(s) copied.
  cl -nologo -GF -W3 -I..\lib\CORE -I.\include -I. -I.. -DWIN32 -D_CONSOLE -DNO_STRICT -D_CRT_SECURE_NO_DEPRECATE -D_CRT_NONSTDC_NO_DEPRECATE -UPERLDLL -DPERL_CORE -O1 -MD -Zi -DNDEBUG -GL -DPERL_TEXTMODE_SCRIPTS -DPERL_IMPLICIT_CONTEXT -DPERL_IMPLICIT_SYS -Foperlmain.obj -c perlmain.c
perlmain.c
  rc -i.. .\perlexe.rc
Microsoft (R) Windows (R) Resource Compiler Version 6.1.7600.16385

Copyright (C) Microsoft Corporation. All rights reserved.


  link -out:..\perl.exe "/manifestdependency:type='Win32' name='Microsoft.Windows.Common-Controls' version='6.0.0.0' processorArchitecture='*' publicKeyToken='6595b64144ccf1df' language='*'" -subsystem:console -nologo -nodefaultlib -debug -opt:ref,icf -ltcg -libpath:"c:\perl\lib\CORE" -machine:x86 perlmain.obj .\perlexe.res ..\perl525.lib oldnames.lib kernel32.lib user32.lib gdi32.lib winspool.lib comdlg32.lib advapi32.lib shell32.lib ole32.lib oleaut32.lib netapi32.lib uuid.lib ws2_32.lib mpr.lib winmm.lib version.lib odbc32.lib odbccp32.lib comctl32.lib msvcrt.lib
Generating code
Finished generating code
  if exist ..\perl.exe.manifest mt -nologo -manifest ..\perl.exe.manifest -outputresource:..\perl.exe;1 && if exist ..\perl.exe.manifest del ..\perl.exe.manifest
  copy ..\perl.exe ..\wperl.exe
         1 file(s) copied.
  ..\miniperl.exe -I..\lib bin\exetype.pl ..\wperl.exe WINDOWS
  xcopy /f /r /i /d /y ..\*.h ..\lib\CORE\*.*
0 File(s) copied
  ..\miniperl.exe -I..\lib ..\make_ext.pl "MAKE=nmake -nologo" --dir=..\cpan --dir=..\dist --dir=..\ext --dynamic
Generating a nmake-style Makefile
Writing Makefile for Cwd
Running Mkbootstrap for Cwd ()
  C:\jenkins\workspace\perl5-win32\miniperl.exe "-I..\..\lib" -MExtUtils::Command -e chmod -- 644 "Cwd.bs"
  C:\jenkins\workspace\perl5-win32\miniperl.exe "-I..\..\lib" -MExtUtils::Command::MM -e cp_nonempty -- Cwd.bs ..\..\lib\auto\Cwd\Cwd.bs 644
  "..\..\miniperl.exe" "-I..\..\lib" "..\..\lib\ExtUtils\xsubpp" -typemap C:\jenkins\workspace\perl5-win32\lib\ExtUtils\typemap Cwd.xs > Cwd.xsc
  C:\jenkins\workspace\perl5-win32\miniperl.exe "-I..\..\lib" -MExtUtils::Command -e mv -- Cwd.xsc Cwd.c
  cl -c -nologo -GF -W3 -O1 -MD -Zi -DNDEBUG -GL -DWIN32 -D_CONSOLE -DNO_STRICT -D_CRT_SECURE_NO_DEPRECATE -D_CRT_NONSTDC_NO_DEPRECATE -DPERL_TEXTMODE_SCRIPTS -DPERL_IMPLICIT_CONTEXT -DPERL_IMPLICIT_SYS -O1 -MD -Zi -DNDEBUG -GL -DVERSION=\"3.64\" -DXS_VERSION=\"3.64\" "-I..\..\lib\CORE" -DDOUBLE_SLASHES_SPECIAL=0 -DNO_PPPORT_H Cwd.c
Cwd.c
  "..\..\miniperl.exe" "-I..\..\lib" -MExtUtils::Mksymlists -e "Mksymlists('NAME'=>\"Cwd\", 'DLBASE' => 'Cwd', 'DL_FUNCS' => { }, 'FUNCLIST' => [], 'IMPORTS' => { }, 'DL_VARS' => []);"
  link -out:..\..\lib\auto\Cwd\Cwd.dll -dll -nologo -nodefaultlib -debug -opt:ref,icf -ltcg -libpath:"c:\perl\lib\CORE" -machine:x86 Cwd.obj "..\..\lib\CORE\perl525.lib" oldnames.lib kernel32.lib user32.lib gdi32.lib winspool.lib comdlg32.lib advapi32.lib shell32.lib ole32.lib oleaut32.lib netapi32.lib uuid.lib ws2_32.lib mpr.lib winmm.lib version.lib odbc32.lib odbccp32.lib comctl32.lib msvcrt.lib -def:Cwd.def
LINK : fatal error LNK1104: cannot open file '..\..\lib\auto\Cwd\Cwd.dll'
NMAKE : fatal error U1077: '"C:\Program Files\Microsoft Visual Studio 10.0\VC\BIN\link.EXE"' : return code '0x450'
Stop.
  C:\jenkins\workspace\perl5-win32\miniperl.exe "-I..\..\lib" -MExtUtils::Command::MM -e cp_nonempty -- Cwd.bs ..\..\lib\auto\Cwd\Cwd.bs 644
  link -out:..\..\lib\auto\Cwd\Cwd.dll -dll -nologo -nodefaultlib -debug -opt:ref,icf -ltcg -libpath:"c:\perl\lib\CORE" -machine:x86 Cwd.obj "..\..\lib\CORE\perl525.lib" oldnames.lib kernel32.lib user32.lib gdi32.lib winspool.lib comdlg32.lib advapi32.lib shell32.lib ole32.lib oleaut32.lib netapi32.lib uuid.lib ws2_32.lib mpr.lib winmm.lib version.lib odbc32.lib odbccp32.lib comctl32.lib msvcrt.lib -def:Cwd.def
LINK : fatal error LNK1104: cannot open file '..\..\lib\auto\Cwd\Cwd.dll'
NMAKE : fatal error U1077: '"C:\Program Files\Microsoft Visual Studio 10.0\VC\BIN\link.EXE"' : return code '0x450'
Stop.
Unsuccessful make(dist/PathTools): code=512 at ..\make_ext.pl line 569.
NMAKE : fatal error U1077: '..\miniperl.exe' : return code '0x2'
Stop.

<http://perl5.git.perl.org:8080/job/perl5-win32/ws/win32>set> PERL_SKIP_TTY_TEST=1

<http://perl5.git.perl.org:8080/job/perl5-win32/ws/win32>nmake> test CCTYPE=MSVC100

Microsoft (R) Program Maintenance Utility Version 10.00.30319.01
Copyright (C) Microsoft Corporation. All rights reserved.

  xcopy /f /r /i /d /y ..\*.h ..\lib\CORE\*.*
0 File(s) copied
  ..\miniperl.exe -I..\lib ..\make_ext.pl "MAKE=nmake -nologo" --dir=..\cpan --dir=..\dist --dir=..\ext --nonxs
Running pm_to_blib for cpan/Pod-Simple directly
Running pm_to_blib for dist/Attribute-Handlers directly
Running pm_to_blib for cpan/AutoLoader directly
Running pm_to_blib for cpan/B-Debug directly
Running pm_to_blib for cpan/CPAN-Meta directly
Running pm_to_blib for cpan/CPAN-Meta-Requirements directly
Running pm_to_blib for cpan/CPAN-Meta-YAML directly
Running pm_to_blib for dist/Carp directly
Running pm_to_blib for cpan/Config-Perl-V directly
Running pm_to_blib for dist/Devel-SelfStubber directly
Running pm_to_blib for cpan/Digest directly
Running pm_to_blib for dist/Dumpvalue directly
Running pm_to_blib for dist/Env directly
Running pm_to_blib for dist/Exporter directly
Running pm_to_blib for dist/ExtUtils-CBuilder directly
Running pm_to_blib for cpan/ExtUtils-Constant directly
Running pm_to_blib for cpan/ExtUtils-Install directly
Running pm_to_blib for ext/ExtUtils-Miniperl directly
Running pm_to_blib for cpan/File-Fetch directly
Running pm_to_blib for ext/File-Find directly
Running pm_to_blib for cpan/File-Path directly
Running pm_to_blib for cpan/File-Temp directly
Running pm_to_blib for ext/FileCache directly
Running pm_to_blib for dist/Filter-Simple directly
Running pm_to_blib for cpan/Getopt-Long directly
Running pm_to_blib for dist/I18N-Collate directly
Running pm_to_blib for dist/I18N-LangTags directly
Running pm_to_blib for cpan/IO-Socket-IP directly
Running pm_to_blib for cpan/IO-Zlib directly
Running pm_to_blib for cpan/IPC-Cmd directly
Running pm_to_blib for ext/IPC-Open3 directly
Running pm_to_blib for cpan/Locale-Codes directly
Running pm_to_blib for dist/Locale-Maketext directly
Running pm_to_blib for cpan/Locale-Maketext-Simple directly
Running pm_to_blib for cpan/Math-BigInt directly
Running pm_to_blib for cpan/Math-BigRat directly
Running pm_to_blib for cpan/Math-Complex directly
Running pm_to_blib for cpan/Memoize directly
Running pm_to_blib for cpan/Module-Load directly
Running pm_to_blib for cpan/Module-Load-Conditional directly
Running pm_to_blib for cpan/Module-Loaded directly
Running pm_to_blib for cpan/NEXT directly
Running pm_to_blib for dist/Net-Ping directly
Running pm_to_blib for cpan/Params-Check directly
Running pm_to_blib for cpan/Perl-OSType directly
Running pm_to_blib for cpan/PerlIO-via-QuotedPrint directly
Running pm_to_blib for cpan/Pod-Escapes directly
  C:\jenkins\workspace\perl5-win32\miniperl.exe "-I..\..\lib" -MExtUtils::Command -e cp -- podselect blib\script\podselect
  "..\..\miniperl.exe" "-I..\..\lib" ..\..\win32\bin\pl2bat.pl blib\script\podselect
  C:\jenkins\workspace\perl5-win32\miniperl.exe "-I..\..\lib" -MExtUtils::Command -e cp -- pod2usage blib\script\pod2usage
  "..\..\miniperl.exe" "-I..\..\lib" ..\..\win32\bin\pl2bat.pl blib\script\pod2usage
Running pm_to_blib for dist/Safe directly
Running pm_to_blib for dist/Search-Dict directly
Running pm_to_blib for dist/SelfLoader directly
Running pm_to_blib for cpan/Term-ANSIColor directly
Running pm_to_blib for dist/Term-Complete directly
Running pm_to_blib for dist/Term-ReadLine directly
Running pm_to_blib for dist/Test directly
Running pm_to_blib for cpan/Test-Simple directly
Running pm_to_blib for dist/Text-Abbrev directly
Running pm_to_blib for cpan/Text-Balanced directly
Running pm_to_blib for cpan/Text-ParseWords directly
Running pm_to_blib for cpan/Text-Tabs directly
Running pm_to_blib for dist/Thread-Queue directly
Running pm_to_blib for dist/Thread-Semaphore directly
Running pm_to_blib for dist/Tie-File directly
Running pm_to_blib for ext/Tie-Memoize directly
Running pm_to_blib for cpan/Tie-RefHash directly
Running pm_to_blib for cpan/Time-Local directly
Running pm_to_blib for cpan/autodie directly
Running pm_to_blib for dist/autouse directly
Running pm_to_blib for cpan/bignum directly
Running pm_to_blib for dist/constant directly
Running pm_to_blib for dist/encoding-warnings directly
Running pm_to_blib for cpan/experimental directly
Running pm_to_blib for dist/if directly
Running pm_to_blib for cpan/parent directly
Running pm_to_blib for cpan/perlfaq directly
  C:\jenkins\workspace\perl5-win32\miniperl.exe "-I..\..\lib" -MExtUtils::Command -e cp -- scripts\pod2text blib\script\pod2text
  "..\..\miniperl.exe" "-I..\..\lib" ..\..\win32\bin\pl2bat.pl blib\script\pod2text
Running pm_to_blib for cpan/version directly
  cd ..\lib\unicore && ..\..\miniperl.exe -I.. mktables -P ..\..\pod -maketest -makelist -p -check ..\lib\unicore\Decomposition.pl ..\lib\unicore\Decomposition.pl
mktables: Files seem to be ok, not bothering to rebuild. Add '-w' option to force build
  cd ..\lib\unicore && ..\..\miniperl.exe -I.. mktables -P ..\..\pod -maketest -makelist -p -check ..\lib\unicore\CombiningClass.pl ..\lib\unicore\Decomposition.pl
Skipping as check params are not the same.
  cd ..\lib\unicore && ..\..\miniperl.exe -I.. mktables -P ..\..\pod -maketest -makelist -p -check ..\lib\unicore\Name.pl ..\lib\unicore\Decomposition.pl
Skipping as check params are not the same.
  cd ..\lib\unicore && ..\..\miniperl.exe -I.. mktables -P ..\..\pod -maketest -makelist -p -check ..\lib\unicore\Heavy.pl ..\lib\unicore\Decomposition.pl
Skipping as check params are not the same.
  cd ..\lib\unicore && ..\..\miniperl.exe -I.. mktables -P ..\..\pod -maketest -makelist -p -check ..\lib\unicore\mktables.lst ..\lib\unicore\Decomposition.pl
Skipping as check params are not the same.
  cd ..\lib\unicore && ..\..\miniperl.exe -I.. mktables -P ..\..\pod -maketest -makelist -p -check ..\lib\unicore\UCD.pl ..\lib\unicore\Decomposition.pl
Skipping as check params are not the same.
  cd ..\lib\unicore && ..\..\miniperl.exe -I.. mktables -P ..\..\pod -maketest -makelist -p -check ..\lib\unicore\Name.pm ..\lib\unicore\Decomposition.pl
Skipping as check params are not the same.
  cd ..\lib\unicore && ..\..\miniperl.exe -I.. mktables -P ..\..\pod -maketest -makelist -p -check ..\lib\unicore\TestProp.pl ..\lib\unicore\Decomposition.pl
Skipping as check params are not the same.
  ..\miniperl.exe -I..\lib ..\mkppport
running "C:\jenkins\workspace\perl5-win32\miniperl.exe" -I..\..\lib PPPort_pm.PL
including ppphdoc
including ppphbin
including version
including threads
including limits
including uv
including memory
including misc
including variables
including mPUSH
including call
including newRV
including newCONSTSUB
including MY_CXT
including format
including SvREFCNT
including newSV_type
including newSVpv
including SvPV
including Sv_set
including sv_xpvf
including shared_pv
including HvNAME
including gv
including warn
including pvs
including magic
including cop
including grok
including snprintf
including sprintf
including exception
including strlfuncs
including pv_tools
running "C:\jenkins\workspace\perl5-win32\miniperl.exe" -I..\..\lib ppport_h.PL
ppport.h in cpan/DB_File is up-to-date
ppport.h in cpan/IPC-SysV is up-to-date
ppport.h in cpan/Scalar-List-Utils is up-to-date
ppport.h in cpan/Win32API-File is up-to-date
ppport.h in dist/PathTools is up-to-date
ppport.h in dist/Time-HiRes is up-to-date
removing temporary file PPPort.pm
removing temporary file ppport.h
  xcopy /f /r /i /d /y ..\*.h ..\lib\CORE\*.*
0 File(s) copied
  ..\miniperl.exe -I..\lib ..\make_ext.pl "MAKE=nmake -nologo" --dir=..\ext --dynaloader
  C:\jenkins\workspace\perl5-win32\miniperl.exe "-I..\..\lib" -MExtUtils::Command -e rm_rf -- ..\..\DynaLoader.obj
  C:\jenkins\workspace\perl5-win32\miniperl.exe "-I..\..\lib" -MExtUtils::Command -e cp -- DynaLoader.obj ..\..\DynaLoader.obj
  xcopy /f /r /i /d /y ..\*.h ..\lib\CORE\*.*
0 File(s) copied
  ..\miniperl.exe -I..\lib ..\make_ext.pl "MAKE=nmake -nologo" --dir=..\cpan --dir=..\dist --dir=..\ext --static
  ..\miniperl.exe -I..\lib list_static_libs.pl > Extensions_static
  link -dll -def:perldll.def -base:0x28000000 -out:..\perl525.dll @Extensions_static @C:\Windows\TEMP\nm3132.tmp
    Creating library ..\perl525.lib and object ..\perl525.exp
Generating code
Finished generating code
  if exist ..\perl525.dll.manifest mt -nologo -manifest ..\perl525.dll.manifest -outputresource:..\perl525.dll;2 && if exist ..\perl525.dll.manifest del ..\perl525.dll.manifest
  xcopy /f /r /i /d /y ..\perl525.lib ..\lib\CORE
C:\jenkins\workspace\perl5-win32\perl525.lib -> C:\jenkins\workspace\perl5-win32\lib\CORE\perl525.lib
1 File(s) copied
  link -out:..\perl.exe "/manifestdependency:type='Win32' name='Microsoft.Windows.Common-Controls' version='6.0.0.0' processorArchitecture='*' publicKeyToken='6595b64144ccf1df' language='*'" -subsystem:console -nologo -nodefaultlib -debug -opt:ref,icf -ltcg -libpath:"c:\perl\lib\CORE" -machine:x86 perlmain.obj .\perlexe.res ..\perl525.lib oldnames.lib kernel32.lib user32.lib gdi32.lib winspool.lib comdlg32.lib advapi32.lib shell32.lib ole32.lib oleaut32.lib netapi32.lib uuid.lib ws2_32.lib mpr.lib winmm.lib version.lib odbc32.lib odbccp32.lib comctl32.lib msvcrt.lib
Generating code
Finished generating code
  if exist ..\perl.exe.manifest mt -nologo -manifest ..\perl.exe.manifest -outputresource:..\perl.exe;1 && if exist ..\perl.exe.manifest del ..\perl.exe.manifest
  copy ..\perl.exe ..\wperl.exe
         1 file(s) copied.
  ..\miniperl.exe -I..\lib bin\exetype.pl ..\wperl.exe WINDOWS
  xcopy /f /r /i /d /y ..\*.h ..\lib\CORE\*.*
0 File(s) copied
  ..\miniperl.exe -I..\lib ..\make_ext.pl "MAKE=nmake -nologo" --dir=..\cpan --dir=..\dist --dir=..\ext --dynamic
  C:\jenkins\workspace\perl5-win32\miniperl.exe "-I..\..\lib" -MExtUtils::Command::MM -e cp_nonempty -- Cwd.bs ..\..\lib\auto\Cwd\Cwd.bs 644
  link -out:..\..\lib\auto\Cwd\Cwd.dll -dll -nologo -nodefaultlib -debug -opt:ref,icf -ltcg -libpath:"c:\perl\lib\CORE" -machine:x86 Cwd.obj "..\..\lib\CORE\perl525.lib" oldnames.lib kernel32.lib user32.lib gdi32.lib winspool.lib comdlg32.lib advapi32.lib shell32.lib ole32.lib oleaut32.lib netapi32.lib uuid.lib ws2_32.lib mpr.lib winmm.lib version.lib odbc32.lib odbccp32.lib comctl32.lib msvcrt.lib -def:Cwd.def
LINK : fatal error LNK1104: cannot open file '..\..\lib\auto\Cwd\Cwd.dll'
NMAKE : fatal error U1077: '"C:\Program Files\Microsoft Visual Studio 10.0\VC\BIN\link.EXE"' : return code '0x450'
Stop.
  C:\jenkins\workspace\perl5-win32\miniperl.exe "-I..\..\lib" -MExtUtils::Command::MM -e cp_nonempty -- Cwd.bs ..\..\lib\auto\Cwd\Cwd.bs 644
  link -out:..\..\lib\auto\Cwd\Cwd.dll -dll -nologo -nodefaultlib -debug -opt:ref,icf -ltcg -libpath:"c:\perl\lib\CORE" -machine:x86 Cwd.obj "..\..\lib\CORE\perl525.lib" oldnames.lib kernel32.lib user32.lib gdi32.lib winspool.lib comdlg32.lib advapi32.lib shell32.lib ole32.lib oleaut32.lib netapi32.lib uuid.lib ws2_32.lib mpr.lib winmm.lib version.lib odbc32.lib odbccp32.lib comctl32.lib msvcrt.lib -def:Cwd.def
LINK : fatal error LNK1104: cannot open file '..\..\lib\auto\Cwd\Cwd.dll'
NMAKE : fatal error U1077: '"C:\Program Files\Microsoft Visual Studio 10.0\VC\BIN\link.EXE"' : return code '0x450'
Stop.
Unsuccessful make(dist/PathTools): code=512 at ..\make_ext.pl line 569.
NMAKE : fatal error U1077: '..\miniperl.exe' : return code '0x2'
Stop.

<http://perl5.git.perl.org:8080/job/perl5-win32/ws/win32>exit> 2
Build step 'Execute Windows batch command' marked build as failure

Search Discussions

  • Dennis+p5p-jenkins at May 25, 2016 at 10:55 pm
    See <http://perl5.git.perl.org:8080/job/perl5-win32/2435/changes>

    Changes:

    [davem] add missing dVAR in pp_avhvswitch

    [davem] porting/libperl.t: better diag output

    [davem] fix locale.c under -DPERL_GLOBAL_STRUCT(_PRIVATE)

    ------------------------------------------
    [...truncated 5894 lines...]
    ../ext/POSIX/t/wrappers.t .......................................... ok
    ../ext/PerlIO-encoding/t/encoding.t ................................ ok
    ../ext/PerlIO-encoding/t/fallback.t ................................ ok
    ../ext/PerlIO-encoding/t/nolooping.t ............................... ok
    ../ext/PerlIO-encoding/t/threads.t ................................. ok
    ../ext/PerlIO-scalar/t/scalar.t .................................... ok
    ../ext/PerlIO-scalar/t/scalar_ungetc.t ............................. ok
    ../ext/PerlIO-via/t/via.t .......................................... ok
    ../ext/Pod-Functions/t/Functions.t ................................. ok
    ../ext/Pod-Html/t/anchorify.t ...................................... ok
    ../ext/Pod-Html/t/cache.t .......................................... ok
    ../ext/Pod-Html/t/crossref.t ....................................... ok
    ../ext/Pod-Html/t/crossref2.t ...................................... ok
    ../ext/Pod-Html/t/crossref3.t ...................................... ok
    ../ext/Pod-Html/t/eol.t ............................................ ok
    ../ext/Pod-Html/t/feature.t ........................................ ok
    ../ext/Pod-Html/t/feature2.t ....................................... ok
    ../ext/Pod-Html/t/htmldir1.t ....................................... ok
    ../ext/Pod-Html/t/htmldir2.t ....................................... ok
    ../ext/Pod-Html/t/htmldir3.t ....................................... ok
    ../ext/Pod-Html/t/htmldir4.t ....................................... ok
    ../ext/Pod-Html/t/htmldir5.t ....................................... ok
    ../ext/Pod-Html/t/htmlescp.t ....................................... ok
    ../ext/Pod-Html/t/htmllink.t ....................................... ok
    ../ext/Pod-Html/t/htmlview.t ....................................... ok
    ../ext/Pod-Html/t/poderr.t ......................................... ok
    ../ext/Pod-Html/t/podnoerr.t ....................................... ok
    ../ext/SDBM_File/t/constants.t ..................................... ok
    ../ext/SDBM_File/t/prep.t .......................................... ok
    ../ext/SDBM_File/t/sdbm.t .......................................... ok
    ../ext/Sys-Hostname/t/Hostname.t ................................... ok
    ../ext/Tie-Hash-NamedCapture/t/tiehash.t ........................... ok
    ../ext/Tie-Memoize/t/Tie-Memoize.t ................................. ok
    ../ext/Win32CORE/t/win32core.t ..................................... ok
    ../ext/XS-APItest/t/addissub.t ..................................... ok
    ../ext/XS-APItest/t/arrayexpr.t .................................... ok
    ../ext/XS-APItest/t/autoload.t ..................................... ok
    ../ext/XS-APItest/t/blockasexpr.t .................................. ok
    ../ext/XS-APItest/t/blockhooks-csc.t ............................... ok
    ../ext/XS-APItest/t/blockhooks.t ................................... ok
    ../ext/XS-APItest/t/call.t ......................................... ok
    ../ext/XS-APItest/t/call_checker.t ................................. ok
    ../ext/XS-APItest/t/caller.t ....................................... ok
    ../ext/XS-APItest/t/callregexec.t .................................. ok
    ../ext/XS-APItest/t/check_warnings.t ............................... ok
    ../ext/XS-APItest/t/cleanup.t ...................................... ok
    ../ext/XS-APItest/t/clone-with-stack.t ............................. ok
    ../ext/XS-APItest/t/cophh.t ........................................ ok
    ../ext/XS-APItest/t/coplabel.t ..................................... ok
    ../ext/XS-APItest/t/copstash.t ..................................... ok
    ../ext/XS-APItest/t/copyhints.t .................................... ok
    ../ext/XS-APItest/t/customop.t ..................................... ok
    ../ext/XS-APItest/t/cv_name.t ...................................... ok
    ../ext/XS-APItest/t/eval-filter.t .................................. ok
    ../ext/XS-APItest/t/exception.t .................................... ok
    ../ext/XS-APItest/t/extend.t ....................................... ok
    ../ext/XS-APItest/t/fetch_pad_names.t .............................. ok
    ../ext/XS-APItest/t/gotosub.t ...................................... ok
    ../ext/XS-APItest/t/grok.t ......................................... ok
    ../ext/XS-APItest/t/gv_autoload4.t ................................. ok
    ../ext/XS-APItest/t/gv_const_sv.t .................................. ok
    ../ext/XS-APItest/t/gv_fetchmeth.t ................................. ok
    ../ext/XS-APItest/t/gv_fetchmeth_autoload.t ........................ ok
    ../ext/XS-APItest/t/gv_fetchmethod_flags.t ......................... ok
    ../ext/XS-APItest/t/gv_init.t ...................................... ok
    ../ext/XS-APItest/t/handy.t ........................................ ok
    ../ext/XS-APItest/t/hash.t ......................................... ok
    ../ext/XS-APItest/t/join_with_space.t .............................. ok
    ../ext/XS-APItest/t/keyword_multiline.t ............................ ok
    ../ext/XS-APItest/t/keyword_plugin.t ............................... ok
    ../ext/XS-APItest/t/labelconst.t ................................... ok
    ../ext/XS-APItest/t/lexsub.t ....................................... ok
    ../ext/XS-APItest/t/load-module.t .................................. ok
    ../ext/XS-APItest/t/locale.t ....................................... ok
    ../ext/XS-APItest/t/loopblock.t .................................... ok
    ../ext/XS-APItest/t/looprest.t ..................................... ok
    ../ext/XS-APItest/t/lvalue.t ....................................... ok
    ../ext/XS-APItest/t/magic.t ........................................ ok
    ../ext/XS-APItest/t/magic_chain.t .................................. ok
    ../ext/XS-APItest/t/mro.t .......................................... ok
    ../ext/XS-APItest/t/multicall.t .................................... ok
    ../ext/XS-APItest/t/my_cxt.t ....................................... ok
    ../ext/XS-APItest/t/my_exit.t ...................................... ok
    ../ext/XS-APItest/t/newCONSTSUB.t .................................. ok
    ../ext/XS-APItest/t/newDEFSVOP.t ................................... ok
    ../ext/XS-APItest/t/op.t ........................................... ok
    ../ext/XS-APItest/t/op_contextualize.t ............................. ok
    ../ext/XS-APItest/t/op_list.t ...................................... ok
    ../ext/XS-APItest/t/overload.t ..................................... ok
    ../ext/XS-APItest/t/pad_scalar.t ................................... ok
    ../ext/XS-APItest/t/peep.t ......................................... ok
    ../ext/XS-APItest/t/pmflag.t ....................................... ok
    ../ext/XS-APItest/t/postinc.t ...................................... ok
    ../ext/XS-APItest/t/printf.t ....................................... ok
    ../ext/XS-APItest/t/ptr_table.t .................................... ok
    ../ext/XS-APItest/t/push.t ......................................... ok
    ../ext/XS-APItest/t/refs.t ......................................... ok
    ../ext/XS-APItest/t/rmagical.t ..................................... ok
    ../ext/XS-APItest/t/rv2cv_op_cv.t .................................. ok
    ../ext/XS-APItest/t/savehints.t .................................... ok
    ../ext/XS-APItest/t/scopelessblock.t ............................... ok
    ../ext/XS-APItest/t/sort.t ......................................... ok
    ../ext/XS-APItest/t/stmtasexpr.t ................................... ok
    ../ext/XS-APItest/t/stmtsasexpr.t .................................. ok
    ../ext/XS-APItest/t/stuff_modify_bug.t ............................. ok
    ../ext/XS-APItest/t/stuff_svcur_bug.t .............................. ok
    ../ext/XS-APItest/t/subcall.t ...................................... ok
    ../ext/XS-APItest/t/svcat.t ........................................ ok
    ../ext/XS-APItest/t/svcatpvf.t ..................................... ok
    ../ext/XS-APItest/t/sviscow.t ...................................... ok
    ../ext/XS-APItest/t/svpeek.t ....................................... ok
    ../ext/XS-APItest/t/svpv.t ......................................... ok
    ../ext/XS-APItest/t/svpv_magic.t ................................... ok
    ../ext/XS-APItest/t/svsetsv.t ...................................... ok
    ../ext/XS-APItest/t/swaplabel.t .................................... ok
    ../ext/XS-APItest/t/swaptwostmts.t ................................. ok
    ../ext/XS-APItest/t/sym-hook.t ..................................... ok
    ../ext/XS-APItest/t/synthetic_scope.t .............................. ok
    ../ext/XS-APItest/t/temp_lv_sub.t .................................. ok
    ../ext/XS-APItest/t/underscore_length.t ............................ ok
    ../ext/XS-APItest/t/utf16_to_utf8.t ................................ ok
    ../ext/XS-APItest/t/utf8.t ......................................... ok
    ../ext/XS-APItest/t/weaken.t ....................................... ok
    ../ext/XS-APItest/t/whichsig.t ..................................... ok
    ../ext/XS-APItest/t/win32.t ........................................ ok
    ../ext/XS-APItest/t/xs_special_subs.t .............................. ok
    ../ext/XS-APItest/t/xs_special_subs_require.t ...................... ok
    ../ext/XS-APItest/t/xsub_h.t ....................................... ok
    ../ext/XS-Typemap/t/Typemap.t ...................................... ok
    ../ext/arybase/t/aeach.t ........................................... ok
    ../ext/arybase/t/aelem.t ........................................... ok
    ../ext/arybase/t/akeys.t ........................................... ok
    ../ext/arybase/t/arybase.t ......................................... ok
    ../ext/arybase/t/aslice.t .......................................... ok
    ../ext/arybase/t/av2arylen.t ....................................... ok
    ../ext/arybase/t/index.t ........................................... ok
    ../ext/arybase/t/lslice.t .......................................... ok
    ../ext/arybase/t/pos.t ............................................. ok
    ../ext/arybase/t/scope.t ........................................... ok
    ../ext/arybase/t/splice.t .......................................... ok
    ../ext/arybase/t/substr.t .......................................... ok
    ../ext/re/t/lexical_debug.t ........................................ ok
    ../ext/re/t/qr.t ................................................... ok
    ../ext/re/t/re.t ................................................... ok
    ../ext/re/t/re_funcs.t ............................................. ok
    ../ext/re/t/re_funcs_u.t ........................................... ok
    ../ext/re/t/reflags.t .............................................. ok
    ../ext/re/t/regop.t ................................................ ok
    ../ext/re/t/strict.t ............................................... ok
    ../lib/AnyDBM_File.t ............................................... ok
    ../lib/B/Deparse-core.t ............................................ ok
    ../lib/B/Deparse-subclass.t ........................................ ok
    ../lib/B/Deparse.t ................................................. ok
    ../lib/Benchmark.t ................................................. ok
    ../lib/Class/Struct.t .............................................. ok
    ../lib/Config.t .................................................... ok
    ../lib/Config/Extensions.t ......................................... ok
    ../lib/DB.t ........................................................ ok
    ../lib/DBM_Filter/t/01error.t ...................................... ok
    ../lib/DBM_Filter/t/02core.t ....................................... ok
    ../lib/DBM_Filter/t/compress.t ..................................... ok
    ../lib/DBM_Filter/t/encode.t ....................................... ok
    ../lib/DBM_Filter/t/int32.t ........................................ ok
    ../lib/DBM_Filter/t/null.t ......................................... ok
    ../lib/DBM_Filter/t/utf8.t ......................................... ok
    ../lib/DirHandle.t ................................................. ok
    ../lib/English.t ................................................... ok
    ../lib/ExtUtils/t/Embed.t .......................................... ok
    ../lib/File/Basename.t ............................................. ok
    ../lib/File/Compare.t .............................................. ok
    ../lib/File/Copy.t ................................................. ok
    ../lib/File/stat-7896.t ............................................ ok
    ../lib/File/stat.t ................................................. ok
    ../lib/FileHandle.t ................................................ ok
    ../lib/FindBin.t ................................................... ok
    ../lib/Getopt/Std.t ................................................ ok
    ../lib/Internals.t ................................................. ok
    ../lib/Net/hostent.t ............................................... ok
    ../lib/Net/netent.t ................................................ skipped: no getnetbyname
    ../lib/Net/protoent.t .............................................. skipped: no netdb.h
    ../lib/Net/servent.t ............................................... skipped: no netdb.h
    ../lib/Pod/t/InputObjects.t ........................................ ok
    ../lib/Pod/t/Select.t .............................................. ok
    ../lib/Pod/t/Usage.t ............................................... ok
    ../lib/Pod/t/utils.t ............................................... ok
    ../lib/SelectSaver.t ............................................... ok
    ../lib/Symbol.t .................................................... ok
    ../lib/Thread.t .................................................... ok
    ../lib/Tie/ExtraHash.t ............................................. ok
    ../lib/Tie/Hash.t .................................................. ok
    ../lib/Tie/Scalar.t ................................................ ok
    ../lib/Tie/SubstrHash.t ............................................ ok
    ../lib/Tie/Array/push.t ............................................ ok
    ../lib/Tie/Array/splice.t .......................................... ok
    ../lib/Tie/Array/std.t ............................................. ok
    ../lib/Tie/Array/stdpush.t ......................................... ok
    ../lib/Tie/Handle/stdhandle.t ...................................... ok
    ../lib/Tie/Handle/stdhandle_from_handle.t .......................... ok
    ../lib/Time/gmtime.t ............................................... ok
    ../lib/Time/localtime.t ............................................ ok
    ../lib/Unicode/UCD.t ............................................... ok
    ../lib/User/grent.t ................................................ skipped: no getgrgid
    ../lib/User/pwent.t ................................................ skipped: no getpwuid
    ../lib/blib.t ...................................................... ok
    ../lib/bytes.t ..................................................... ok
    ../lib/charnames.t ................................................. ok
    ../lib/diagnostics.t ............................................... ok
    ../lib/dumpvar.t ................................................... ok
    ../lib/feature.t ................................................... ok
    ../lib/feature/unicode_strings.t ................................... ok
    ../lib/filetest.t .................................................. ok
    ../lib/h2ph.t ...................................................... ok
    ../lib/h2xs.t ...................................................... ok
    ../lib/integer.t ................................................... ok
    ../lib/less.t ...................................................... ok
    ../lib/locale.t .................................................... ok
    ../lib/meta_notation.t ............................................. ok
    ../lib/open.t ...................................................... ok
    ../lib/overload.t .................................................. ok
    ../lib/overload64.t ................................................ skipped: -- Perl configured with 32-bit ints
    ../lib/overloading.t ............................................... ok
    ../lib/perl5db.t ................................................... skipped: no /dev/null
    ../lib/perlbug.t ................................................... ok
    ../lib/sigtrap.t ................................................... ok
    ../lib/sort.t ...................................................... ok
    ../lib/strict.t .................................................... ok
    ../lib/subs.t ...................................................... ok
    ../lib/utf8.t ...................................................... ok
    ../lib/vars.t ...................................................... ok
    ../lib/vars_carp.t ................................................. ok
    ../lib/vmsish.t .................................................... ok
    ../lib/warnings.t .................................................. ok

    Test Summary Report
    -------------------
    ../cpan/Archive-Tar/t/09_roundtrip.t (Wstat: 0 Tests: 7 Failed: 0)
       TODO passed: 1, 4, 6
    ../cpan/ExtUtils-MakeMaker/t/basic.t (Wstat: 3840 Tests: 186 Failed: 15)
       Failed tests: 22-23, 34-36, 69, 178-186
       Non-zero exit status: 15
    ../ext/IPC-Open3/t/IPC-Open3.t (Wstat: 0 Tests: 45 Failed: 0)
       TODO passed: 25
    Files=2467, Tests=826487, 1855 wallclock secs (97.72 usr + 7.41 sys = 105.13 CPU)
    Result: FAIL
    NMAKE : fatal error U1077: '.\perl.exe' : return code '0xf'
    Stop.

    <http://perl5.git.perl.org:8080/job/perl5-win32/ws/win32>exit> 2
    Build step 'Execute Windows batch command' marked build as failure
  • Dennis+p5p-jenkins at May 26, 2016 at 3:17 am
    See <http://perl5.git.perl.org:8080/job/perl5-win32/2436/changes>

    Changes:

    [khw] porting/dual-life.t: Clarify test messages

    [khw] Devel::Peek: Fix a couple of pod glitches

    [khw] ext/VMS-DCLsym/DCLsym.pm: Fix missing pod reference

    ------------------------------------------
    [...truncated 6698 lines...]
    ../ext/POSIX/t/wrappers.t .......................................... ok
    ../ext/PerlIO-encoding/t/encoding.t ................................ ok
    ../ext/PerlIO-encoding/t/fallback.t ................................ ok
    ../ext/PerlIO-encoding/t/nolooping.t ............................... ok
    ../ext/PerlIO-encoding/t/threads.t ................................. ok
    ../ext/PerlIO-scalar/t/scalar.t .................................... ok
    ../ext/PerlIO-scalar/t/scalar_ungetc.t ............................. ok
    ../ext/PerlIO-via/t/via.t .......................................... ok
    ../ext/Pod-Functions/t/Functions.t ................................. ok
    ../ext/Pod-Html/t/anchorify.t ...................................... ok
    ../ext/Pod-Html/t/cache.t .......................................... ok
    ../ext/Pod-Html/t/crossref.t ....................................... ok
    ../ext/Pod-Html/t/crossref2.t ...................................... ok
    ../ext/Pod-Html/t/crossref3.t ...................................... ok
    ../ext/Pod-Html/t/eol.t ............................................ ok
    ../ext/Pod-Html/t/feature.t ........................................ ok
    ../ext/Pod-Html/t/feature2.t ....................................... ok
    ../ext/Pod-Html/t/htmldir1.t ....................................... ok
    ../ext/Pod-Html/t/htmldir2.t ....................................... ok
    ../ext/Pod-Html/t/htmldir3.t ....................................... ok
    ../ext/Pod-Html/t/htmldir4.t ....................................... ok
    ../ext/Pod-Html/t/htmldir5.t ....................................... ok
    ../ext/Pod-Html/t/htmlescp.t ....................................... ok
    ../ext/Pod-Html/t/htmllink.t ....................................... ok
    ../ext/Pod-Html/t/htmlview.t ....................................... ok
    ../ext/Pod-Html/t/poderr.t ......................................... ok
    ../ext/Pod-Html/t/podnoerr.t ....................................... ok
    ../ext/SDBM_File/t/constants.t ..................................... ok
    ../ext/SDBM_File/t/prep.t .......................................... ok
    ../ext/SDBM_File/t/sdbm.t .......................................... ok
    ../ext/Sys-Hostname/t/Hostname.t ................................... ok
    ../ext/Tie-Hash-NamedCapture/t/tiehash.t ........................... ok
    ../ext/Tie-Memoize/t/Tie-Memoize.t ................................. ok
    ../ext/Win32CORE/t/win32core.t ..................................... ok
    ../ext/XS-APItest/t/addissub.t ..................................... ok
    ../ext/XS-APItest/t/arrayexpr.t .................................... ok
    ../ext/XS-APItest/t/autoload.t ..................................... ok
    ../ext/XS-APItest/t/blockasexpr.t .................................. ok
    ../ext/XS-APItest/t/blockhooks-csc.t ............................... ok
    ../ext/XS-APItest/t/blockhooks.t ................................... ok
    ../ext/XS-APItest/t/call.t ......................................... ok
    ../ext/XS-APItest/t/call_checker.t ................................. ok
    ../ext/XS-APItest/t/caller.t ....................................... ok
    ../ext/XS-APItest/t/callregexec.t .................................. ok
    ../ext/XS-APItest/t/check_warnings.t ............................... ok
    ../ext/XS-APItest/t/cleanup.t ...................................... ok
    ../ext/XS-APItest/t/clone-with-stack.t ............................. ok
    ../ext/XS-APItest/t/cophh.t ........................................ ok
    ../ext/XS-APItest/t/coplabel.t ..................................... ok
    ../ext/XS-APItest/t/copstash.t ..................................... ok
    ../ext/XS-APItest/t/copyhints.t .................................... ok
    ../ext/XS-APItest/t/customop.t ..................................... ok
    ../ext/XS-APItest/t/cv_name.t ...................................... ok
    ../ext/XS-APItest/t/eval-filter.t .................................. ok
    ../ext/XS-APItest/t/exception.t .................................... ok
    ../ext/XS-APItest/t/extend.t ....................................... ok
    ../ext/XS-APItest/t/fetch_pad_names.t .............................. ok
    ../ext/XS-APItest/t/gotosub.t ...................................... ok
    ../ext/XS-APItest/t/grok.t ......................................... ok
    ../ext/XS-APItest/t/gv_autoload4.t ................................. ok
    ../ext/XS-APItest/t/gv_const_sv.t .................................. ok
    ../ext/XS-APItest/t/gv_fetchmeth.t ................................. ok
    ../ext/XS-APItest/t/gv_fetchmeth_autoload.t ........................ ok
    ../ext/XS-APItest/t/gv_fetchmethod_flags.t ......................... ok
    ../ext/XS-APItest/t/gv_init.t ...................................... ok
    ../ext/XS-APItest/t/handy.t ........................................ ok
    ../ext/XS-APItest/t/hash.t ......................................... ok
    ../ext/XS-APItest/t/join_with_space.t .............................. ok
    ../ext/XS-APItest/t/keyword_multiline.t ............................ ok
    ../ext/XS-APItest/t/keyword_plugin.t ............................... ok
    ../ext/XS-APItest/t/labelconst.t ................................... ok
    ../ext/XS-APItest/t/lexsub.t ....................................... ok
    ../ext/XS-APItest/t/load-module.t .................................. ok
    ../ext/XS-APItest/t/locale.t ....................................... ok
    ../ext/XS-APItest/t/loopblock.t .................................... ok
    ../ext/XS-APItest/t/looprest.t ..................................... ok
    ../ext/XS-APItest/t/lvalue.t ....................................... ok
    ../ext/XS-APItest/t/magic.t ........................................ ok
    ../ext/XS-APItest/t/magic_chain.t .................................. ok
    ../ext/XS-APItest/t/mro.t .......................................... ok
    ../ext/XS-APItest/t/multicall.t .................................... ok
    ../ext/XS-APItest/t/my_cxt.t ....................................... ok
    ../ext/XS-APItest/t/my_exit.t ...................................... ok
    ../ext/XS-APItest/t/newCONSTSUB.t .................................. ok
    ../ext/XS-APItest/t/newDEFSVOP.t ................................... ok
    ../ext/XS-APItest/t/op.t ........................................... ok
    ../ext/XS-APItest/t/op_contextualize.t ............................. ok
    ../ext/XS-APItest/t/op_list.t ...................................... ok
    ../ext/XS-APItest/t/overload.t ..................................... ok
    ../ext/XS-APItest/t/pad_scalar.t ................................... ok
    ../ext/XS-APItest/t/peep.t ......................................... ok
    ../ext/XS-APItest/t/pmflag.t ....................................... ok
    ../ext/XS-APItest/t/postinc.t ...................................... ok
    ../ext/XS-APItest/t/printf.t ....................................... ok
    ../ext/XS-APItest/t/ptr_table.t .................................... ok
    ../ext/XS-APItest/t/push.t ......................................... ok
    ../ext/XS-APItest/t/refs.t ......................................... ok
    ../ext/XS-APItest/t/rmagical.t ..................................... ok
    ../ext/XS-APItest/t/rv2cv_op_cv.t .................................. ok
    ../ext/XS-APItest/t/savehints.t .................................... ok
    ../ext/XS-APItest/t/scopelessblock.t ............................... ok
    ../ext/XS-APItest/t/sort.t ......................................... ok
    ../ext/XS-APItest/t/stmtasexpr.t ................................... ok
    ../ext/XS-APItest/t/stmtsasexpr.t .................................. ok
    ../ext/XS-APItest/t/stuff_modify_bug.t ............................. ok
    ../ext/XS-APItest/t/stuff_svcur_bug.t .............................. ok
    ../ext/XS-APItest/t/subcall.t ...................................... ok
    ../ext/XS-APItest/t/svcat.t ........................................ ok
    ../ext/XS-APItest/t/svcatpvf.t ..................................... ok
    ../ext/XS-APItest/t/sviscow.t ...................................... ok
    ../ext/XS-APItest/t/svpeek.t ....................................... ok
    ../ext/XS-APItest/t/svpv.t ......................................... ok
    ../ext/XS-APItest/t/svpv_magic.t ................................... ok
    ../ext/XS-APItest/t/svsetsv.t ...................................... ok
    ../ext/XS-APItest/t/swaplabel.t .................................... ok
    ../ext/XS-APItest/t/swaptwostmts.t ................................. ok
    ../ext/XS-APItest/t/sym-hook.t ..................................... ok
    ../ext/XS-APItest/t/synthetic_scope.t .............................. ok
    ../ext/XS-APItest/t/temp_lv_sub.t .................................. ok
    ../ext/XS-APItest/t/underscore_length.t ............................ ok
    ../ext/XS-APItest/t/utf16_to_utf8.t ................................ ok
    ../ext/XS-APItest/t/utf8.t ......................................... ok
    ../ext/XS-APItest/t/weaken.t ....................................... ok
    ../ext/XS-APItest/t/whichsig.t ..................................... ok
    ../ext/XS-APItest/t/win32.t ........................................ ok
    ../ext/XS-APItest/t/xs_special_subs.t .............................. ok
    ../ext/XS-APItest/t/xs_special_subs_require.t ...................... ok
    ../ext/XS-APItest/t/xsub_h.t ....................................... ok
    ../ext/XS-Typemap/t/Typemap.t ...................................... ok
    ../ext/arybase/t/aeach.t ........................................... ok
    ../ext/arybase/t/aelem.t ........................................... ok
    ../ext/arybase/t/akeys.t ........................................... ok
    ../ext/arybase/t/arybase.t ......................................... ok
    ../ext/arybase/t/aslice.t .......................................... ok
    ../ext/arybase/t/av2arylen.t ....................................... ok
    ../ext/arybase/t/index.t ........................................... ok
    ../ext/arybase/t/lslice.t .......................................... ok
    ../ext/arybase/t/pos.t ............................................. ok
    ../ext/arybase/t/scope.t ........................................... ok
    ../ext/arybase/t/splice.t .......................................... ok
    ../ext/arybase/t/substr.t .......................................... ok
    ../ext/re/t/lexical_debug.t ........................................ ok
    ../ext/re/t/qr.t ................................................... ok
    ../ext/re/t/re.t ................................................... ok
    ../ext/re/t/re_funcs.t ............................................. ok
    ../ext/re/t/re_funcs_u.t ........................................... ok
    ../ext/re/t/reflags.t .............................................. ok
    ../ext/re/t/regop.t ................................................ ok
    ../ext/re/t/strict.t ............................................... ok
    ../lib/AnyDBM_File.t ............................................... ok
    ../lib/B/Deparse-core.t ............................................ ok
    ../lib/B/Deparse-subclass.t ........................................ ok
    ../lib/B/Deparse.t ................................................. ok
    ../lib/Benchmark.t ................................................. ok
    ../lib/Class/Struct.t .............................................. ok
    ../lib/Config.t .................................................... ok
    ../lib/Config/Extensions.t ......................................... ok
    ../lib/DB.t ........................................................ ok
    ../lib/DBM_Filter/t/01error.t ...................................... ok
    ../lib/DBM_Filter/t/02core.t ....................................... ok
    ../lib/DBM_Filter/t/compress.t ..................................... ok
    ../lib/DBM_Filter/t/encode.t ....................................... ok
    ../lib/DBM_Filter/t/int32.t ........................................ ok
    ../lib/DBM_Filter/t/null.t ......................................... ok
    ../lib/DBM_Filter/t/utf8.t ......................................... ok
    ../lib/DirHandle.t ................................................. ok
    ../lib/English.t ................................................... ok
    ../lib/ExtUtils/t/Embed.t .......................................... ok
    ../lib/File/Basename.t ............................................. ok
    ../lib/File/Compare.t .............................................. ok
    ../lib/File/Copy.t ................................................. ok
    ../lib/File/stat-7896.t ............................................ ok
    ../lib/File/stat.t ................................................. ok
    ../lib/FileHandle.t ................................................ ok
    ../lib/FindBin.t ................................................... ok
    ../lib/Getopt/Std.t ................................................ ok
    ../lib/Internals.t ................................................. ok
    ../lib/Net/hostent.t ............................................... ok
    ../lib/Net/netent.t ................................................ skipped: no getnetbyname
    ../lib/Net/protoent.t .............................................. skipped: no netdb.h
    ../lib/Net/servent.t ............................................... skipped: no netdb.h
    ../lib/Pod/t/InputObjects.t ........................................ ok
    ../lib/Pod/t/Select.t .............................................. ok
    ../lib/Pod/t/Usage.t ............................................... ok
    ../lib/Pod/t/utils.t ............................................... ok
    ../lib/SelectSaver.t ............................................... ok
    ../lib/Symbol.t .................................................... ok
    ../lib/Thread.t .................................................... ok
    ../lib/Tie/ExtraHash.t ............................................. ok
    ../lib/Tie/Hash.t .................................................. ok
    ../lib/Tie/Scalar.t ................................................ ok
    ../lib/Tie/SubstrHash.t ............................................ ok
    ../lib/Tie/Array/push.t ............................................ ok
    ../lib/Tie/Array/splice.t .......................................... ok
    ../lib/Tie/Array/std.t ............................................. ok
    ../lib/Tie/Array/stdpush.t ......................................... ok
    ../lib/Tie/Handle/stdhandle.t ...................................... ok
    ../lib/Tie/Handle/stdhandle_from_handle.t .......................... ok
    ../lib/Time/gmtime.t ............................................... ok
    ../lib/Time/localtime.t ............................................ ok
    ../lib/Unicode/UCD.t ............................................... ok
    ../lib/User/grent.t ................................................ skipped: no getgrgid
    ../lib/User/pwent.t ................................................ skipped: no getpwuid
    ../lib/blib.t ...................................................... ok
    ../lib/bytes.t ..................................................... ok
    ../lib/charnames.t ................................................. ok
    ../lib/diagnostics.t ............................................... ok
    ../lib/dumpvar.t ................................................... ok
    ../lib/feature.t ................................................... ok
    ../lib/feature/unicode_strings.t ................................... ok
    ../lib/filetest.t .................................................. ok
    ../lib/h2ph.t ...................................................... ok
    ../lib/h2xs.t ...................................................... ok
    ../lib/integer.t ................................................... ok
    ../lib/less.t ...................................................... ok
    ../lib/locale.t .................................................... ok
    ../lib/meta_notation.t ............................................. ok
    ../lib/open.t ...................................................... ok
    ../lib/overload.t .................................................. ok
    ../lib/overload64.t ................................................ skipped: -- Perl configured with 32-bit ints
    ../lib/overloading.t ............................................... ok
    ../lib/perl5db.t ................................................... skipped: no /dev/null
    ../lib/perlbug.t ................................................... ok
    ../lib/sigtrap.t ................................................... ok
    ../lib/sort.t ...................................................... ok
    ../lib/strict.t .................................................... ok
    ../lib/subs.t ...................................................... ok
    ../lib/utf8.t ...................................................... ok
    ../lib/vars.t ...................................................... ok
    ../lib/vars_carp.t ................................................. ok
    ../lib/vmsish.t .................................................... ok
    ../lib/warnings.t .................................................. ok

    Test Summary Report
    -------------------
    ../cpan/Archive-Tar/t/09_roundtrip.t (Wstat: 0 Tests: 7 Failed: 0)
       TODO passed: 1, 4, 6
    ../cpan/ExtUtils-MakeMaker/t/basic.t (Wstat: 3840 Tests: 186 Failed: 15)
       Failed tests: 22-23, 34-36, 69, 178-186
       Non-zero exit status: 15
    ../ext/IPC-Open3/t/IPC-Open3.t (Wstat: 0 Tests: 45 Failed: 0)
       TODO passed: 25
    Files=2467, Tests=826424, 1840 wallclock secs (102.28 usr + 8.36 sys = 110.64 CPU)
    Result: FAIL
    NMAKE : fatal error U1077: '.\perl.exe' : return code '0xf'
    Stop.

    <http://perl5.git.perl.org:8080/job/perl5-win32/ws/win32>exit> 2
    Build step 'Execute Windows batch command' marked build as failure
  • Dennis+p5p-jenkins at May 26, 2016 at 5:18 am
    See <http://perl5.git.perl.org:8080/job/perl5-win32/2437/changes>

    Changes:

    [khw] regcomp.c: Add shortcuts to some inversion list ops

    ------------------------------------------
    [...truncated 6672 lines...]
    ../ext/PerlIO-encoding/t/nolooping.t ............................... ok
    ../ext/PerlIO-encoding/t/threads.t ................................. ok
    ../ext/PerlIO-scalar/t/scalar.t .................................... ok
    ../ext/PerlIO-scalar/t/scalar_ungetc.t ............................. ok
    ../ext/PerlIO-via/t/via.t .......................................... ok
    ../ext/Pod-Functions/t/Functions.t ................................. ok
    ../ext/Pod-Html/t/anchorify.t ...................................... ok
    ../ext/Pod-Html/t/cache.t .......................................... ok
    ../ext/Pod-Html/t/crossref.t ....................................... ok
    ../ext/Pod-Html/t/crossref2.t ...................................... ok
    ../ext/Pod-Html/t/crossref3.t ...................................... ok
    ../ext/Pod-Html/t/eol.t ............................................ ok
    ../ext/Pod-Html/t/feature.t ........................................ ok
    ../ext/Pod-Html/t/feature2.t ....................................... ok
    ../ext/Pod-Html/t/htmldir1.t ....................................... ok
    ../ext/Pod-Html/t/htmldir2.t ....................................... ok
    ../ext/Pod-Html/t/htmldir3.t ....................................... ok
    ../ext/Pod-Html/t/htmldir4.t ....................................... ok
    ../ext/Pod-Html/t/htmldir5.t ....................................... ok
    ../ext/Pod-Html/t/htmlescp.t ....................................... ok
    ../ext/Pod-Html/t/htmllink.t ....................................... ok
    ../ext/Pod-Html/t/htmlview.t ....................................... ok
    ../ext/Pod-Html/t/poderr.t ......................................... ok
    ../ext/Pod-Html/t/podnoerr.t ....................................... ok
    ../ext/SDBM_File/t/constants.t ..................................... ok
    ../ext/SDBM_File/t/prep.t .......................................... ok
    ../ext/SDBM_File/t/sdbm.t .......................................... ok
    ../ext/Sys-Hostname/t/Hostname.t ................................... ok
    ../ext/Tie-Hash-NamedCapture/t/tiehash.t ........................... ok
    ../ext/Tie-Memoize/t/Tie-Memoize.t ................................. ok
    ../ext/Win32CORE/t/win32core.t ..................................... ok
    ../ext/XS-APItest/t/addissub.t ..................................... ok
    ../ext/XS-APItest/t/arrayexpr.t .................................... ok
    ../ext/XS-APItest/t/autoload.t ..................................... ok
    ../ext/XS-APItest/t/blockasexpr.t .................................. ok
    ../ext/XS-APItest/t/blockhooks-csc.t ............................... ok
    ../ext/XS-APItest/t/blockhooks.t ................................... ok
    ../ext/XS-APItest/t/call.t ......................................... ok
    ../ext/XS-APItest/t/call_checker.t ................................. ok
    ../ext/XS-APItest/t/caller.t ....................................... ok
    ../ext/XS-APItest/t/callregexec.t .................................. ok
    ../ext/XS-APItest/t/check_warnings.t ............................... ok
    ../ext/XS-APItest/t/cleanup.t ...................................... ok
    ../ext/XS-APItest/t/clone-with-stack.t ............................. ok
    ../ext/XS-APItest/t/cophh.t ........................................ ok
    ../ext/XS-APItest/t/coplabel.t ..................................... ok
    ../ext/XS-APItest/t/copstash.t ..................................... ok
    ../ext/XS-APItest/t/copyhints.t .................................... ok
    ../ext/XS-APItest/t/customop.t ..................................... ok
    ../ext/XS-APItest/t/cv_name.t ...................................... ok
    ../ext/XS-APItest/t/eval-filter.t .................................. ok
    ../ext/XS-APItest/t/exception.t .................................... ok
    ../ext/XS-APItest/t/extend.t ....................................... ok
    ../ext/XS-APItest/t/fetch_pad_names.t .............................. ok
    ../ext/XS-APItest/t/gotosub.t ...................................... ok
    ../ext/XS-APItest/t/grok.t ......................................... ok
    ../ext/XS-APItest/t/gv_autoload4.t ................................. ok
    ../ext/XS-APItest/t/gv_const_sv.t .................................. ok
    ../ext/XS-APItest/t/gv_fetchmeth.t ................................. ok
    ../ext/XS-APItest/t/gv_fetchmeth_autoload.t ........................ ok
    ../ext/XS-APItest/t/gv_fetchmethod_flags.t ......................... ok
    ../ext/XS-APItest/t/gv_init.t ...................................... ok
    ../ext/XS-APItest/t/handy.t ........................................ ok
    ../ext/XS-APItest/t/hash.t ......................................... ok
    ../ext/XS-APItest/t/join_with_space.t .............................. ok
    ../ext/XS-APItest/t/keyword_multiline.t ............................ ok
    ../ext/XS-APItest/t/keyword_plugin.t ............................... ok
    ../ext/XS-APItest/t/labelconst.t ................................... ok
    ../ext/XS-APItest/t/lexsub.t ....................................... ok
    ../ext/XS-APItest/t/load-module.t .................................. ok
    ../ext/XS-APItest/t/locale.t ....................................... ok
    ../ext/XS-APItest/t/loopblock.t .................................... ok
    ../ext/XS-APItest/t/looprest.t ..................................... ok
    ../ext/XS-APItest/t/lvalue.t ....................................... ok
    ../ext/XS-APItest/t/magic.t ........................................ ok
    ../ext/XS-APItest/t/magic_chain.t .................................. ok
    ../ext/XS-APItest/t/mro.t .......................................... ok
    ../ext/XS-APItest/t/multicall.t .................................... ok
    ../ext/XS-APItest/t/my_cxt.t ....................................... ok
    ../ext/XS-APItest/t/my_exit.t ...................................... ok
    ../ext/XS-APItest/t/newCONSTSUB.t .................................. ok
    ../ext/XS-APItest/t/newDEFSVOP.t ................................... ok
    ../ext/XS-APItest/t/op.t ........................................... ok
    ../ext/XS-APItest/t/op_contextualize.t ............................. ok
    ../ext/XS-APItest/t/op_list.t ...................................... ok
    ../ext/XS-APItest/t/overload.t ..................................... ok
    ../ext/XS-APItest/t/pad_scalar.t ................................... ok
    ../ext/XS-APItest/t/peep.t ......................................... ok
    ../ext/XS-APItest/t/pmflag.t ....................................... ok
    ../ext/XS-APItest/t/postinc.t ...................................... ok
    ../ext/XS-APItest/t/printf.t ....................................... ok
    ../ext/XS-APItest/t/ptr_table.t .................................... ok
    ../ext/XS-APItest/t/push.t ......................................... ok
    ../ext/XS-APItest/t/refs.t ......................................... ok
    ../ext/XS-APItest/t/rmagical.t ..................................... ok
    ../ext/XS-APItest/t/rv2cv_op_cv.t .................................. ok
    ../ext/XS-APItest/t/savehints.t .................................... ok
    ../ext/XS-APItest/t/scopelessblock.t ............................... ok
    ../ext/XS-APItest/t/sort.t ......................................... ok
    ../ext/XS-APItest/t/stmtasexpr.t ................................... ok
    ../ext/XS-APItest/t/stmtsasexpr.t .................................. ok
    ../ext/XS-APItest/t/stuff_modify_bug.t ............................. ok
    ../ext/XS-APItest/t/stuff_svcur_bug.t .............................. ok
    ../ext/XS-APItest/t/subcall.t ...................................... ok
    ../ext/XS-APItest/t/svcat.t ........................................ ok
    ../ext/XS-APItest/t/svcatpvf.t ..................................... ok
    ../ext/XS-APItest/t/sviscow.t ...................................... ok
    ../ext/XS-APItest/t/svpeek.t ....................................... ok
    ../ext/XS-APItest/t/svpv.t ......................................... ok
    ../ext/XS-APItest/t/svpv_magic.t ................................... ok
    ../ext/XS-APItest/t/svsetsv.t ...................................... ok
    ../ext/XS-APItest/t/swaplabel.t .................................... ok
    ../ext/XS-APItest/t/swaptwostmts.t ................................. ok
    ../ext/XS-APItest/t/sym-hook.t ..................................... ok
    ../ext/XS-APItest/t/synthetic_scope.t .............................. ok
    ../ext/XS-APItest/t/temp_lv_sub.t .................................. ok
    ../ext/XS-APItest/t/underscore_length.t ............................ ok
    ../ext/XS-APItest/t/utf16_to_utf8.t ................................ ok
    ../ext/XS-APItest/t/utf8.t ......................................... ok
    ../ext/XS-APItest/t/weaken.t ....................................... ok
    ../ext/XS-APItest/t/whichsig.t ..................................... ok
    ../ext/XS-APItest/t/win32.t ........................................ ok
    ../ext/XS-APItest/t/xs_special_subs.t .............................. ok
    ../ext/XS-APItest/t/xs_special_subs_require.t ...................... ok
    ../ext/XS-APItest/t/xsub_h.t ....................................... ok
    ../ext/XS-Typemap/t/Typemap.t ...................................... ok
    ../ext/arybase/t/aeach.t ........................................... ok
    ../ext/arybase/t/aelem.t ........................................... ok
    ../ext/arybase/t/akeys.t ........................................... ok
    ../ext/arybase/t/arybase.t ......................................... ok
    ../ext/arybase/t/aslice.t .......................................... ok
    ../ext/arybase/t/av2arylen.t ....................................... ok
    ../ext/arybase/t/index.t ........................................... ok
    ../ext/arybase/t/lslice.t .......................................... ok
    ../ext/arybase/t/pos.t ............................................. ok
    ../ext/arybase/t/scope.t ........................................... ok
    ../ext/arybase/t/splice.t .......................................... ok
    ../ext/arybase/t/substr.t .......................................... ok
    ../ext/re/t/lexical_debug.t ........................................ ok
    ../ext/re/t/qr.t ................................................... ok
    ../ext/re/t/re.t ................................................... ok
    ../ext/re/t/re_funcs.t ............................................. ok
    ../ext/re/t/re_funcs_u.t ........................................... ok
    ../ext/re/t/reflags.t .............................................. ok
    ../ext/re/t/regop.t ................................................ ok
    ../ext/re/t/strict.t ............................................... ok
    ../lib/AnyDBM_File.t ............................................... ok
    ../lib/B/Deparse-core.t ............................................ ok
    ../lib/B/Deparse-subclass.t ........................................ ok
    ../lib/B/Deparse.t ................................................. ok
    ../lib/Benchmark.t ................................................. ok
    ../lib/Class/Struct.t .............................................. ok
    ../lib/Config.t .................................................... ok
    ../lib/Config/Extensions.t ......................................... ok
    ../lib/DB.t ........................................................ ok
    ../lib/DBM_Filter/t/01error.t ...................................... ok
    ../lib/DBM_Filter/t/02core.t ....................................... ok
    ../lib/DBM_Filter/t/compress.t ..................................... ok
    ../lib/DBM_Filter/t/encode.t ....................................... ok
    ../lib/DBM_Filter/t/int32.t ........................................ ok
    ../lib/DBM_Filter/t/null.t ......................................... ok
    ../lib/DBM_Filter/t/utf8.t ......................................... ok
    ../lib/DirHandle.t ................................................. ok
    ../lib/English.t ................................................... ok
    ../lib/ExtUtils/t/Embed.t .......................................... ok
    ../lib/File/Basename.t ............................................. ok
    ../lib/File/Compare.t .............................................. ok
    ../lib/File/Copy.t ................................................. ok
    ../lib/File/stat-7896.t ............................................ ok
    ../lib/File/stat.t ................................................. ok
    ../lib/FileHandle.t ................................................ ok
    ../lib/FindBin.t ................................................... ok
    ../lib/Getopt/Std.t ................................................ ok
    ../lib/Internals.t ................................................. ok
    ../lib/Net/hostent.t ............................................... ok
    ../lib/Net/netent.t ................................................ skipped: no getnetbyname
    ../lib/Net/protoent.t .............................................. skipped: no netdb.h
    ../lib/Net/servent.t ............................................... skipped: no netdb.h
    ../lib/Pod/t/InputObjects.t ........................................ ok
    ../lib/Pod/t/Select.t .............................................. ok
    ../lib/Pod/t/Usage.t ............................................... ok
    ../lib/Pod/t/utils.t ............................................... ok
    ../lib/SelectSaver.t ............................................... ok
    ../lib/Symbol.t .................................................... ok
    ../lib/Thread.t .................................................... ok
    ../lib/Tie/ExtraHash.t ............................................. ok
    ../lib/Tie/Hash.t .................................................. ok
    ../lib/Tie/Scalar.t ................................................ ok
    ../lib/Tie/SubstrHash.t ............................................ ok
    ../lib/Tie/Array/push.t ............................................ ok
    ../lib/Tie/Array/splice.t .......................................... ok
    ../lib/Tie/Array/std.t ............................................. ok
    ../lib/Tie/Array/stdpush.t ......................................... ok
    ../lib/Tie/Handle/stdhandle.t ...................................... ok
    ../lib/Tie/Handle/stdhandle_from_handle.t .......................... ok
    ../lib/Time/gmtime.t ............................................... ok
    ../lib/Time/localtime.t ............................................ ok
    ../lib/Unicode/UCD.t ............................................... ok
    ../lib/User/grent.t ................................................ skipped: no getgrgid
    ../lib/User/pwent.t ................................................ skipped: no getpwuid
    ../lib/blib.t ...................................................... ok
    ../lib/bytes.t ..................................................... ok
    ../lib/charnames.t ................................................. ok
    ../lib/diagnostics.t ............................................... ok
    ../lib/dumpvar.t ................................................... ok
    ../lib/feature.t ................................................... ok
    ../lib/feature/unicode_strings.t ................................... ok
    ../lib/filetest.t .................................................. ok
    ../lib/h2ph.t ...................................................... ok
    ../lib/h2xs.t ...................................................... ok
    ../lib/integer.t ................................................... ok
    ../lib/less.t ...................................................... ok
    ../lib/locale.t .................................................... ok
    ../lib/meta_notation.t ............................................. ok
    ../lib/open.t ...................................................... ok
    ../lib/overload.t .................................................. ok
    ../lib/overload64.t ................................................ skipped: -- Perl configured with 32-bit ints
    ../lib/overloading.t ............................................... ok
    ../lib/perl5db.t ................................................... skipped: no /dev/null
    ../lib/perlbug.t ................................................... ok
    ../lib/sigtrap.t ................................................... ok
    ../lib/sort.t ...................................................... ok
    ../lib/strict.t .................................................... ok
    ../lib/subs.t ...................................................... ok
    ../lib/utf8.t ...................................................... ok
    ../lib/vars.t ...................................................... ok
    ../lib/vars_carp.t ................................................. ok
    ../lib/vmsish.t .................................................... ok
    ../lib/warnings.t .................................................. ok

    Test Summary Report
    -------------------
    ../cpan/Archive-Tar/t/09_roundtrip.t (Wstat: 0 Tests: 7 Failed: 0)
       TODO passed: 1, 4, 6
    ../cpan/ExtUtils-MakeMaker/t/basic.t (Wstat: 3840 Tests: 186 Failed: 15)
       Failed tests: 22-23, 34-36, 69, 178-186
       Non-zero exit status: 15
    ../cpan/IPC-Cmd/t/01_IPC-Cmd.t (Wstat: 512 Tests: 459 Failed: 2)
       Failed tests: 41-42
       Non-zero exit status: 2
    ../ext/IPC-Open3/t/IPC-Open3.t (Wstat: 0 Tests: 45 Failed: 0)
       TODO passed: 25
    Files=2467, Tests=826417, 1862 wallclock secs (98.55 usr + 7.33 sys = 105.88 CPU)
    Result: FAIL
    NMAKE : fatal error U1077: '.\perl.exe' : return code '0x11'
    Stop.

    <http://perl5.git.perl.org:8080/job/perl5-win32/ws/win32>exit> 2
    Build step 'Execute Windows batch command' marked build as failure
  • Dennis+p5p-jenkins at May 27, 2016 at 6:08 pm
    See <http://perl5.git.perl.org:8080/job/perl5-win32/2438/changes>

    Changes:

    [khw] podcheck.t: Move a declaration

    [xsawyerx] Subject: Pod::Checker: convert files from DOS to unix

    ------------------------------------------
    [...truncated 6658 lines...]
    ../ext/POSIX/t/wrappers.t .......................................... ok
    ../ext/PerlIO-encoding/t/encoding.t ................................ ok
    ../ext/PerlIO-encoding/t/fallback.t ................................ ok
    ../ext/PerlIO-encoding/t/nolooping.t ............................... ok
    ../ext/PerlIO-encoding/t/threads.t ................................. ok
    ../ext/PerlIO-scalar/t/scalar.t .................................... ok
    ../ext/PerlIO-scalar/t/scalar_ungetc.t ............................. ok
    ../ext/PerlIO-via/t/via.t .......................................... ok
    ../ext/Pod-Functions/t/Functions.t ................................. ok
    ../ext/Pod-Html/t/anchorify.t ...................................... ok
    ../ext/Pod-Html/t/cache.t .......................................... ok
    ../ext/Pod-Html/t/crossref.t ....................................... ok
    ../ext/Pod-Html/t/crossref2.t ...................................... ok
    ../ext/Pod-Html/t/crossref3.t ...................................... ok
    ../ext/Pod-Html/t/eol.t ............................................ ok
    ../ext/Pod-Html/t/feature.t ........................................ ok
    ../ext/Pod-Html/t/feature2.t ....................................... ok
    ../ext/Pod-Html/t/htmldir1.t ....................................... ok
    ../ext/Pod-Html/t/htmldir2.t ....................................... ok
    ../ext/Pod-Html/t/htmldir3.t ....................................... ok
    ../ext/Pod-Html/t/htmldir4.t ....................................... ok
    ../ext/Pod-Html/t/htmldir5.t ....................................... ok
    ../ext/Pod-Html/t/htmlescp.t ....................................... ok
    ../ext/Pod-Html/t/htmllink.t ....................................... ok
    ../ext/Pod-Html/t/htmlview.t ....................................... ok
    ../ext/Pod-Html/t/poderr.t ......................................... ok
    ../ext/Pod-Html/t/podnoerr.t ....................................... ok
    ../ext/SDBM_File/t/constants.t ..................................... ok
    ../ext/SDBM_File/t/prep.t .......................................... ok
    ../ext/SDBM_File/t/sdbm.t .......................................... ok
    ../ext/Sys-Hostname/t/Hostname.t ................................... ok
    ../ext/Tie-Hash-NamedCapture/t/tiehash.t ........................... ok
    ../ext/Tie-Memoize/t/Tie-Memoize.t ................................. ok
    ../ext/Win32CORE/t/win32core.t ..................................... ok
    ../ext/XS-APItest/t/addissub.t ..................................... ok
    ../ext/XS-APItest/t/arrayexpr.t .................................... ok
    ../ext/XS-APItest/t/autoload.t ..................................... ok
    ../ext/XS-APItest/t/blockasexpr.t .................................. ok
    ../ext/XS-APItest/t/blockhooks-csc.t ............................... ok
    ../ext/XS-APItest/t/blockhooks.t ................................... ok
    ../ext/XS-APItest/t/call.t ......................................... ok
    ../ext/XS-APItest/t/call_checker.t ................................. ok
    ../ext/XS-APItest/t/caller.t ....................................... ok
    ../ext/XS-APItest/t/callregexec.t .................................. ok
    ../ext/XS-APItest/t/check_warnings.t ............................... ok
    ../ext/XS-APItest/t/cleanup.t ...................................... ok
    ../ext/XS-APItest/t/clone-with-stack.t ............................. ok
    ../ext/XS-APItest/t/cophh.t ........................................ ok
    ../ext/XS-APItest/t/coplabel.t ..................................... ok
    ../ext/XS-APItest/t/copstash.t ..................................... ok
    ../ext/XS-APItest/t/copyhints.t .................................... ok
    ../ext/XS-APItest/t/customop.t ..................................... ok
    ../ext/XS-APItest/t/cv_name.t ...................................... ok
    ../ext/XS-APItest/t/eval-filter.t .................................. ok
    ../ext/XS-APItest/t/exception.t .................................... ok
    ../ext/XS-APItest/t/extend.t ....................................... ok
    ../ext/XS-APItest/t/fetch_pad_names.t .............................. ok
    ../ext/XS-APItest/t/gotosub.t ...................................... ok
    ../ext/XS-APItest/t/grok.t ......................................... ok
    ../ext/XS-APItest/t/gv_autoload4.t ................................. ok
    ../ext/XS-APItest/t/gv_const_sv.t .................................. ok
    ../ext/XS-APItest/t/gv_fetchmeth.t ................................. ok
    ../ext/XS-APItest/t/gv_fetchmeth_autoload.t ........................ ok
    ../ext/XS-APItest/t/gv_fetchmethod_flags.t ......................... ok
    ../ext/XS-APItest/t/gv_init.t ...................................... ok
    ../ext/XS-APItest/t/handy.t ........................................ ok
    ../ext/XS-APItest/t/hash.t ......................................... ok
    ../ext/XS-APItest/t/join_with_space.t .............................. ok
    ../ext/XS-APItest/t/keyword_multiline.t ............................ ok
    ../ext/XS-APItest/t/keyword_plugin.t ............................... ok
    ../ext/XS-APItest/t/labelconst.t ................................... ok
    ../ext/XS-APItest/t/lexsub.t ....................................... ok
    ../ext/XS-APItest/t/load-module.t .................................. ok
    ../ext/XS-APItest/t/locale.t ....................................... ok
    ../ext/XS-APItest/t/loopblock.t .................................... ok
    ../ext/XS-APItest/t/looprest.t ..................................... ok
    ../ext/XS-APItest/t/lvalue.t ....................................... ok
    ../ext/XS-APItest/t/magic.t ........................................ ok
    ../ext/XS-APItest/t/magic_chain.t .................................. ok
    ../ext/XS-APItest/t/mro.t .......................................... ok
    ../ext/XS-APItest/t/multicall.t .................................... ok
    ../ext/XS-APItest/t/my_cxt.t ....................................... ok
    ../ext/XS-APItest/t/my_exit.t ...................................... ok
    ../ext/XS-APItest/t/newCONSTSUB.t .................................. ok
    ../ext/XS-APItest/t/newDEFSVOP.t ................................... ok
    ../ext/XS-APItest/t/op.t ........................................... ok
    ../ext/XS-APItest/t/op_contextualize.t ............................. ok
    ../ext/XS-APItest/t/op_list.t ...................................... ok
    ../ext/XS-APItest/t/overload.t ..................................... ok
    ../ext/XS-APItest/t/pad_scalar.t ................................... ok
    ../ext/XS-APItest/t/peep.t ......................................... ok
    ../ext/XS-APItest/t/pmflag.t ....................................... ok
    ../ext/XS-APItest/t/postinc.t ...................................... ok
    ../ext/XS-APItest/t/printf.t ....................................... ok
    ../ext/XS-APItest/t/ptr_table.t .................................... ok
    ../ext/XS-APItest/t/push.t ......................................... ok
    ../ext/XS-APItest/t/refs.t ......................................... ok
    ../ext/XS-APItest/t/rmagical.t ..................................... ok
    ../ext/XS-APItest/t/rv2cv_op_cv.t .................................. ok
    ../ext/XS-APItest/t/savehints.t .................................... ok
    ../ext/XS-APItest/t/scopelessblock.t ............................... ok
    ../ext/XS-APItest/t/sort.t ......................................... ok
    ../ext/XS-APItest/t/stmtasexpr.t ................................... ok
    ../ext/XS-APItest/t/stmtsasexpr.t .................................. ok
    ../ext/XS-APItest/t/stuff_modify_bug.t ............................. ok
    ../ext/XS-APItest/t/stuff_svcur_bug.t .............................. ok
    ../ext/XS-APItest/t/subcall.t ...................................... ok
    ../ext/XS-APItest/t/svcat.t ........................................ ok
    ../ext/XS-APItest/t/svcatpvf.t ..................................... ok
    ../ext/XS-APItest/t/sviscow.t ...................................... ok
    ../ext/XS-APItest/t/svpeek.t ....................................... ok
    ../ext/XS-APItest/t/svpv.t ......................................... ok
    ../ext/XS-APItest/t/svpv_magic.t ................................... ok
    ../ext/XS-APItest/t/svsetsv.t ...................................... ok
    ../ext/XS-APItest/t/swaplabel.t .................................... ok
    ../ext/XS-APItest/t/swaptwostmts.t ................................. ok
    ../ext/XS-APItest/t/sym-hook.t ..................................... ok
    ../ext/XS-APItest/t/synthetic_scope.t .............................. ok
    ../ext/XS-APItest/t/temp_lv_sub.t .................................. ok
    ../ext/XS-APItest/t/underscore_length.t ............................ ok
    ../ext/XS-APItest/t/utf16_to_utf8.t ................................ ok
    ../ext/XS-APItest/t/utf8.t ......................................... ok
    ../ext/XS-APItest/t/weaken.t ....................................... ok
    ../ext/XS-APItest/t/whichsig.t ..................................... ok
    ../ext/XS-APItest/t/win32.t ........................................ ok
    ../ext/XS-APItest/t/xs_special_subs.t .............................. ok
    ../ext/XS-APItest/t/xs_special_subs_require.t ...................... ok
    ../ext/XS-APItest/t/xsub_h.t ....................................... ok
    ../ext/XS-Typemap/t/Typemap.t ...................................... ok
    ../ext/arybase/t/aeach.t ........................................... ok
    ../ext/arybase/t/aelem.t ........................................... ok
    ../ext/arybase/t/akeys.t ........................................... ok
    ../ext/arybase/t/arybase.t ......................................... ok
    ../ext/arybase/t/aslice.t .......................................... ok
    ../ext/arybase/t/av2arylen.t ....................................... ok
    ../ext/arybase/t/index.t ........................................... ok
    ../ext/arybase/t/lslice.t .......................................... ok
    ../ext/arybase/t/pos.t ............................................. ok
    ../ext/arybase/t/scope.t ........................................... ok
    ../ext/arybase/t/splice.t .......................................... ok
    ../ext/arybase/t/substr.t .......................................... ok
    ../ext/re/t/lexical_debug.t ........................................ ok
    ../ext/re/t/qr.t ................................................... ok
    ../ext/re/t/re.t ................................................... ok
    ../ext/re/t/re_funcs.t ............................................. ok
    ../ext/re/t/re_funcs_u.t ........................................... ok
    ../ext/re/t/reflags.t .............................................. ok
    ../ext/re/t/regop.t ................................................ ok
    ../ext/re/t/strict.t ............................................... ok
    ../lib/AnyDBM_File.t ............................................... ok
    ../lib/B/Deparse-core.t ............................................ ok
    ../lib/B/Deparse-subclass.t ........................................ ok
    ../lib/B/Deparse.t ................................................. ok
    ../lib/Benchmark.t ................................................. ok
    ../lib/Class/Struct.t .............................................. ok
    ../lib/Config.t .................................................... ok
    ../lib/Config/Extensions.t ......................................... ok
    ../lib/DB.t ........................................................ ok
    ../lib/DBM_Filter/t/01error.t ...................................... ok
    ../lib/DBM_Filter/t/02core.t ....................................... ok
    ../lib/DBM_Filter/t/compress.t ..................................... ok
    ../lib/DBM_Filter/t/encode.t ....................................... ok
    ../lib/DBM_Filter/t/int32.t ........................................ ok
    ../lib/DBM_Filter/t/null.t ......................................... ok
    ../lib/DBM_Filter/t/utf8.t ......................................... ok
    ../lib/DirHandle.t ................................................. ok
    ../lib/English.t ................................................... ok
    ../lib/ExtUtils/t/Embed.t .......................................... ok
    ../lib/File/Basename.t ............................................. ok
    ../lib/File/Compare.t .............................................. ok
    ../lib/File/Copy.t ................................................. ok
    ../lib/File/stat-7896.t ............................................ ok
    ../lib/File/stat.t ................................................. ok
    ../lib/FileHandle.t ................................................ ok
    ../lib/FindBin.t ................................................... ok
    ../lib/Getopt/Std.t ................................................ ok
    ../lib/Internals.t ................................................. ok
    ../lib/Net/hostent.t ............................................... ok
    ../lib/Net/netent.t ................................................ skipped: no getnetbyname
    ../lib/Net/protoent.t .............................................. skipped: no netdb.h
    ../lib/Net/servent.t ............................................... skipped: no netdb.h
    ../lib/Pod/t/InputObjects.t ........................................ ok
    ../lib/Pod/t/Select.t .............................................. ok
    ../lib/Pod/t/Usage.t ............................................... ok
    ../lib/Pod/t/utils.t ............................................... ok
    ../lib/SelectSaver.t ............................................... ok
    ../lib/Symbol.t .................................................... ok
    ../lib/Thread.t .................................................... ok
    ../lib/Tie/ExtraHash.t ............................................. ok
    ../lib/Tie/Hash.t .................................................. ok
    ../lib/Tie/Scalar.t ................................................ ok
    ../lib/Tie/SubstrHash.t ............................................ ok
    ../lib/Tie/Array/push.t ............................................ ok
    ../lib/Tie/Array/splice.t .......................................... ok
    ../lib/Tie/Array/std.t ............................................. ok
    ../lib/Tie/Array/stdpush.t ......................................... ok
    ../lib/Tie/Handle/stdhandle.t ...................................... ok
    ../lib/Tie/Handle/stdhandle_from_handle.t .......................... ok
    ../lib/Time/gmtime.t ............................................... ok
    ../lib/Time/localtime.t ............................................ ok
    ../lib/Unicode/UCD.t ............................................... ok
    ../lib/User/grent.t ................................................ skipped: no getgrgid
    ../lib/User/pwent.t ................................................ skipped: no getpwuid
    ../lib/blib.t ...................................................... ok
    ../lib/bytes.t ..................................................... ok
    ../lib/charnames.t ................................................. ok
    ../lib/diagnostics.t ............................................... ok
    ../lib/dumpvar.t ................................................... ok
    ../lib/feature.t ................................................... ok
    ../lib/feature/unicode_strings.t ................................... ok
    ../lib/filetest.t .................................................. ok
    ../lib/h2ph.t ...................................................... ok
    ../lib/h2xs.t ...................................................... ok
    ../lib/integer.t ................................................... ok
    ../lib/less.t ...................................................... ok
    ../lib/locale.t .................................................... ok
    ../lib/meta_notation.t ............................................. ok
    ../lib/open.t ...................................................... ok
    ../lib/overload.t .................................................. ok
    ../lib/overload64.t ................................................ skipped: -- Perl configured with 32-bit ints
    ../lib/overloading.t ............................................... ok
    ../lib/perl5db.t ................................................... skipped: no /dev/null
    ../lib/perlbug.t ................................................... ok
    ../lib/sigtrap.t ................................................... ok
    ../lib/sort.t ...................................................... ok
    ../lib/strict.t .................................................... ok
    ../lib/subs.t ...................................................... ok
    ../lib/utf8.t ...................................................... ok
    ../lib/vars.t ...................................................... ok
    ../lib/vars_carp.t ................................................. ok
    ../lib/vmsish.t .................................................... ok
    ../lib/warnings.t .................................................. ok

    Test Summary Report
    -------------------
    ../cpan/Archive-Tar/t/09_roundtrip.t (Wstat: 0 Tests: 7 Failed: 0)
       TODO passed: 1, 4, 6
    ../cpan/ExtUtils-MakeMaker/t/basic.t (Wstat: 3840 Tests: 186 Failed: 15)
       Failed tests: 22-23, 34-36, 69, 178-186
       Non-zero exit status: 15
    ../ext/IPC-Open3/t/IPC-Open3.t (Wstat: 0 Tests: 45 Failed: 0)
       TODO passed: 25
    Files=2467, Tests=826479, 1833 wallclock secs (96.42 usr + 7.58 sys = 104.00 CPU)
    Result: FAIL
    NMAKE : fatal error U1077: '.\perl.exe' : return code '0xf'
    Stop.

    <http://perl5.git.perl.org:8080/job/perl5-win32/ws/win32>exit> 2
    Build step 'Execute Windows batch command' marked build as failure
  • Dennis+p5p-jenkins at May 27, 2016 at 6:47 pm
    See <http://perl5.git.perl.org:8080/job/perl5-win32/2439/changes>

    Changes:

    [khw] Update Pod::Checker to CPAN version 1.72

    [khw] podcheck.t: Use new Pod::Checker

    [khw] podcheck.t: Include tr// and y// detection

    ------------------------------------------
    [...truncated 6729 lines...]
    ../ext/PerlIO-encoding/t/nolooping.t ............................... ok
    ../ext/PerlIO-encoding/t/threads.t ................................. ok
    ../ext/PerlIO-scalar/t/scalar.t .................................... ok
    ../ext/PerlIO-scalar/t/scalar_ungetc.t ............................. ok
    ../ext/PerlIO-via/t/via.t .......................................... ok
    ../ext/Pod-Functions/t/Functions.t ................................. ok
    ../ext/Pod-Html/t/anchorify.t ...................................... ok
    ../ext/Pod-Html/t/cache.t .......................................... ok
    ../ext/Pod-Html/t/crossref.t ....................................... ok
    ../ext/Pod-Html/t/crossref2.t ...................................... ok
    ../ext/Pod-Html/t/crossref3.t ...................................... ok
    ../ext/Pod-Html/t/eol.t ............................................ ok
    ../ext/Pod-Html/t/feature.t ........................................ ok
    ../ext/Pod-Html/t/feature2.t ....................................... ok
    ../ext/Pod-Html/t/htmldir1.t ....................................... ok
    ../ext/Pod-Html/t/htmldir2.t ....................................... ok
    ../ext/Pod-Html/t/htmldir3.t ....................................... ok
    ../ext/Pod-Html/t/htmldir4.t ....................................... ok
    ../ext/Pod-Html/t/htmldir5.t ....................................... ok
    ../ext/Pod-Html/t/htmlescp.t ....................................... ok
    ../ext/Pod-Html/t/htmllink.t ....................................... ok
    ../ext/Pod-Html/t/htmlview.t ....................................... ok
    ../ext/Pod-Html/t/poderr.t ......................................... ok
    ../ext/Pod-Html/t/podnoerr.t ....................................... ok
    ../ext/SDBM_File/t/constants.t ..................................... ok
    ../ext/SDBM_File/t/prep.t .......................................... ok
    ../ext/SDBM_File/t/sdbm.t .......................................... ok
    ../ext/Sys-Hostname/t/Hostname.t ................................... ok
    ../ext/Tie-Hash-NamedCapture/t/tiehash.t ........................... ok
    ../ext/Tie-Memoize/t/Tie-Memoize.t ................................. ok
    ../ext/Win32CORE/t/win32core.t ..................................... ok
    ../ext/XS-APItest/t/addissub.t ..................................... ok
    ../ext/XS-APItest/t/arrayexpr.t .................................... ok
    ../ext/XS-APItest/t/autoload.t ..................................... ok
    ../ext/XS-APItest/t/blockasexpr.t .................................. ok
    ../ext/XS-APItest/t/blockhooks-csc.t ............................... ok
    ../ext/XS-APItest/t/blockhooks.t ................................... ok
    ../ext/XS-APItest/t/call.t ......................................... ok
    ../ext/XS-APItest/t/call_checker.t ................................. ok
    ../ext/XS-APItest/t/caller.t ....................................... ok
    ../ext/XS-APItest/t/callregexec.t .................................. ok
    ../ext/XS-APItest/t/check_warnings.t ............................... ok
    ../ext/XS-APItest/t/cleanup.t ...................................... ok
    ../ext/XS-APItest/t/clone-with-stack.t ............................. ok
    ../ext/XS-APItest/t/cophh.t ........................................ ok
    ../ext/XS-APItest/t/coplabel.t ..................................... ok
    ../ext/XS-APItest/t/copstash.t ..................................... ok
    ../ext/XS-APItest/t/copyhints.t .................................... ok
    ../ext/XS-APItest/t/customop.t ..................................... ok
    ../ext/XS-APItest/t/cv_name.t ...................................... ok
    ../ext/XS-APItest/t/eval-filter.t .................................. ok
    ../ext/XS-APItest/t/exception.t .................................... ok
    ../ext/XS-APItest/t/extend.t ....................................... ok
    ../ext/XS-APItest/t/fetch_pad_names.t .............................. ok
    ../ext/XS-APItest/t/gotosub.t ...................................... ok
    ../ext/XS-APItest/t/grok.t ......................................... ok
    ../ext/XS-APItest/t/gv_autoload4.t ................................. ok
    ../ext/XS-APItest/t/gv_const_sv.t .................................. ok
    ../ext/XS-APItest/t/gv_fetchmeth.t ................................. ok
    ../ext/XS-APItest/t/gv_fetchmeth_autoload.t ........................ ok
    ../ext/XS-APItest/t/gv_fetchmethod_flags.t ......................... ok
    ../ext/XS-APItest/t/gv_init.t ...................................... ok
    ../ext/XS-APItest/t/handy.t ........................................ ok
    ../ext/XS-APItest/t/hash.t ......................................... ok
    ../ext/XS-APItest/t/join_with_space.t .............................. ok
    ../ext/XS-APItest/t/keyword_multiline.t ............................ ok
    ../ext/XS-APItest/t/keyword_plugin.t ............................... ok
    ../ext/XS-APItest/t/labelconst.t ................................... ok
    ../ext/XS-APItest/t/lexsub.t ....................................... ok
    ../ext/XS-APItest/t/load-module.t .................................. ok
    ../ext/XS-APItest/t/locale.t ....................................... ok
    ../ext/XS-APItest/t/loopblock.t .................................... ok
    ../ext/XS-APItest/t/looprest.t ..................................... ok
    ../ext/XS-APItest/t/lvalue.t ....................................... ok
    ../ext/XS-APItest/t/magic.t ........................................ ok
    ../ext/XS-APItest/t/magic_chain.t .................................. ok
    ../ext/XS-APItest/t/mro.t .......................................... ok
    ../ext/XS-APItest/t/multicall.t .................................... ok
    ../ext/XS-APItest/t/my_cxt.t ....................................... ok
    ../ext/XS-APItest/t/my_exit.t ...................................... ok
    ../ext/XS-APItest/t/newCONSTSUB.t .................................. ok
    ../ext/XS-APItest/t/newDEFSVOP.t ................................... ok
    ../ext/XS-APItest/t/op.t ........................................... ok
    ../ext/XS-APItest/t/op_contextualize.t ............................. ok
    ../ext/XS-APItest/t/op_list.t ...................................... ok
    ../ext/XS-APItest/t/overload.t ..................................... ok
    ../ext/XS-APItest/t/pad_scalar.t ................................... ok
    ../ext/XS-APItest/t/peep.t ......................................... ok
    ../ext/XS-APItest/t/pmflag.t ....................................... ok
    ../ext/XS-APItest/t/postinc.t ...................................... ok
    ../ext/XS-APItest/t/printf.t ....................................... ok
    ../ext/XS-APItest/t/ptr_table.t .................................... ok
    ../ext/XS-APItest/t/push.t ......................................... ok
    ../ext/XS-APItest/t/refs.t ......................................... ok
    ../ext/XS-APItest/t/rmagical.t ..................................... ok
    ../ext/XS-APItest/t/rv2cv_op_cv.t .................................. ok
    ../ext/XS-APItest/t/savehints.t .................................... ok
    ../ext/XS-APItest/t/scopelessblock.t ............................... ok
    ../ext/XS-APItest/t/sort.t ......................................... ok
    ../ext/XS-APItest/t/stmtasexpr.t ................................... ok
    ../ext/XS-APItest/t/stmtsasexpr.t .................................. ok
    ../ext/XS-APItest/t/stuff_modify_bug.t ............................. ok
    ../ext/XS-APItest/t/stuff_svcur_bug.t .............................. ok
    ../ext/XS-APItest/t/subcall.t ...................................... ok
    ../ext/XS-APItest/t/svcat.t ........................................ ok
    ../ext/XS-APItest/t/svcatpvf.t ..................................... ok
    ../ext/XS-APItest/t/sviscow.t ...................................... ok
    ../ext/XS-APItest/t/svpeek.t ....................................... ok
    ../ext/XS-APItest/t/svpv.t ......................................... ok
    ../ext/XS-APItest/t/svpv_magic.t ................................... ok
    ../ext/XS-APItest/t/svsetsv.t ...................................... ok
    ../ext/XS-APItest/t/swaplabel.t .................................... ok
    ../ext/XS-APItest/t/swaptwostmts.t ................................. ok
    ../ext/XS-APItest/t/sym-hook.t ..................................... ok
    ../ext/XS-APItest/t/synthetic_scope.t .............................. ok
    ../ext/XS-APItest/t/temp_lv_sub.t .................................. ok
    ../ext/XS-APItest/t/underscore_length.t ............................ ok
    ../ext/XS-APItest/t/utf16_to_utf8.t ................................ ok
    ../ext/XS-APItest/t/utf8.t ......................................... ok
    ../ext/XS-APItest/t/weaken.t ....................................... ok
    ../ext/XS-APItest/t/whichsig.t ..................................... ok
    ../ext/XS-APItest/t/win32.t ........................................ ok
    ../ext/XS-APItest/t/xs_special_subs.t .............................. ok
    ../ext/XS-APItest/t/xs_special_subs_require.t ...................... ok
    ../ext/XS-APItest/t/xsub_h.t ....................................... ok
    ../ext/XS-Typemap/t/Typemap.t ...................................... ok
    ../ext/arybase/t/aeach.t ........................................... ok
    ../ext/arybase/t/aelem.t ........................................... ok
    ../ext/arybase/t/akeys.t ........................................... ok
    ../ext/arybase/t/arybase.t ......................................... ok
    ../ext/arybase/t/aslice.t .......................................... ok
    ../ext/arybase/t/av2arylen.t ....................................... ok
    ../ext/arybase/t/index.t ........................................... ok
    ../ext/arybase/t/lslice.t .......................................... ok
    ../ext/arybase/t/pos.t ............................................. ok
    ../ext/arybase/t/scope.t ........................................... ok
    ../ext/arybase/t/splice.t .......................................... ok
    ../ext/arybase/t/substr.t .......................................... ok
    ../ext/re/t/lexical_debug.t ........................................ ok
    ../ext/re/t/qr.t ................................................... ok
    ../ext/re/t/re.t ................................................... ok
    ../ext/re/t/re_funcs.t ............................................. ok
    ../ext/re/t/re_funcs_u.t ........................................... ok
    ../ext/re/t/reflags.t .............................................. ok
    ../ext/re/t/regop.t ................................................ ok
    ../ext/re/t/strict.t ............................................... ok
    ../lib/AnyDBM_File.t ............................................... ok
    ../lib/B/Deparse-core.t ............................................ ok
    ../lib/B/Deparse-subclass.t ........................................ ok
    ../lib/B/Deparse.t ................................................. ok
    ../lib/Benchmark.t ................................................. ok
    ../lib/Class/Struct.t .............................................. ok
    ../lib/Config.t .................................................... ok
    ../lib/Config/Extensions.t ......................................... ok
    ../lib/DB.t ........................................................ ok
    ../lib/DBM_Filter/t/01error.t ...................................... ok
    ../lib/DBM_Filter/t/02core.t ....................................... ok
    ../lib/DBM_Filter/t/compress.t ..................................... ok
    ../lib/DBM_Filter/t/encode.t ....................................... ok
    ../lib/DBM_Filter/t/int32.t ........................................ ok
    ../lib/DBM_Filter/t/null.t ......................................... ok
    ../lib/DBM_Filter/t/utf8.t ......................................... ok
    ../lib/DirHandle.t ................................................. ok
    ../lib/English.t ................................................... ok
    ../lib/ExtUtils/t/Embed.t .......................................... ok
    ../lib/File/Basename.t ............................................. ok
    ../lib/File/Compare.t .............................................. ok
    ../lib/File/Copy.t ................................................. ok
    ../lib/File/stat-7896.t ............................................ ok
    ../lib/File/stat.t ................................................. ok
    ../lib/FileHandle.t ................................................ ok
    ../lib/FindBin.t ................................................... ok
    ../lib/Getopt/Std.t ................................................ ok
    ../lib/Internals.t ................................................. ok
    ../lib/Net/hostent.t ............................................... ok
    ../lib/Net/netent.t ................................................ skipped: no getnetbyname
    ../lib/Net/protoent.t .............................................. skipped: no netdb.h
    ../lib/Net/servent.t ............................................... skipped: no netdb.h
    ../lib/Pod/t/InputObjects.t ........................................ ok
    ../lib/Pod/t/Select.t .............................................. ok
    ../lib/Pod/t/Usage.t ............................................... ok
    ../lib/Pod/t/utils.t ............................................... ok
    ../lib/SelectSaver.t ............................................... ok
    ../lib/Symbol.t .................................................... ok
    ../lib/Thread.t .................................................... ok
    ../lib/Tie/ExtraHash.t ............................................. ok
    ../lib/Tie/Hash.t .................................................. ok
    ../lib/Tie/Scalar.t ................................................ ok
    ../lib/Tie/SubstrHash.t ............................................ ok
    ../lib/Tie/Array/push.t ............................................ ok
    ../lib/Tie/Array/splice.t .......................................... ok
    ../lib/Tie/Array/std.t ............................................. ok
    ../lib/Tie/Array/stdpush.t ......................................... ok
    ../lib/Tie/Handle/stdhandle.t ...................................... ok
    ../lib/Tie/Handle/stdhandle_from_handle.t .......................... ok
    ../lib/Time/gmtime.t ............................................... ok
    ../lib/Time/localtime.t ............................................ ok
    ../lib/Unicode/UCD.t ............................................... ok
    ../lib/User/grent.t ................................................ skipped: no getgrgid
    ../lib/User/pwent.t ................................................ skipped: no getpwuid
    ../lib/blib.t ...................................................... ok
    ../lib/bytes.t ..................................................... ok
    ../lib/charnames.t ................................................. ok
    ../lib/diagnostics.t ............................................... ok
    ../lib/dumpvar.t ................................................... ok
    ../lib/feature.t ................................................... ok
    ../lib/feature/unicode_strings.t ................................... ok
    ../lib/filetest.t .................................................. ok
    ../lib/h2ph.t ...................................................... ok
    ../lib/h2xs.t ...................................................... ok
    ../lib/integer.t ................................................... ok
    ../lib/less.t ...................................................... ok
    ../lib/locale.t .................................................... ok
    ../lib/meta_notation.t ............................................. ok
    ../lib/open.t ...................................................... ok
    ../lib/overload.t .................................................. ok
    ../lib/overload64.t ................................................ skipped: -- Perl configured with 32-bit ints
    ../lib/overloading.t ............................................... ok
    ../lib/perl5db.t ................................................... skipped: no /dev/null
    ../lib/perlbug.t ................................................... ok
    ../lib/sigtrap.t ................................................... ok
    ../lib/sort.t ...................................................... ok
    ../lib/strict.t .................................................... ok
    ../lib/subs.t ...................................................... ok
    ../lib/utf8.t ...................................................... ok
    ../lib/vars.t ...................................................... ok
    ../lib/vars_carp.t ................................................. ok
    ../lib/vmsish.t .................................................... ok
    ../lib/warnings.t .................................................. ok

    Test Summary Report
    -------------------
    ../cpan/Archive-Tar/t/09_roundtrip.t (Wstat: 0 Tests: 7 Failed: 0)
       TODO passed: 1, 4, 6
    ../cpan/ExtUtils-MakeMaker/t/basic.t (Wstat: 3840 Tests: 186 Failed: 15)
       Failed tests: 22-23, 34-36, 69, 178-186
       Non-zero exit status: 15
    ../cpan/IPC-Cmd/t/01_IPC-Cmd.t (Wstat: 768 Tests: 459 Failed: 3)
       Failed tests: 87, 93-94
       Non-zero exit status: 3
    ../ext/IPC-Open3/t/IPC-Open3.t (Wstat: 0 Tests: 45 Failed: 0)
       TODO passed: 25
    Files=2468, Tests=826533, 1833 wallclock secs (93.75 usr + 7.41 sys = 101.16 CPU)
    Result: FAIL
    NMAKE : fatal error U1077: '.\perl.exe' : return code '0x12'
    Stop.

    <http://perl5.git.perl.org:8080/job/perl5-win32/ws/win32>exit> 2
    Build step 'Execute Windows batch command' marked build as failure

Related Discussions

Discussion Navigation
viewthread | post
Discussion Overview
groupperl5-porters @
categoriesperl
postedMay 25, '16 at 4:12a
activeMay 27, '16 at 6:47p
posts6
users1
websiteperl.org

1 user in discussion

Dennis+p5p-jenkins: 6 posts

People

Translate

site design / logo © 2018 Grokbase