Grokbase Groups Lucene dev June 2016
FAQ
Build: https://builds.apache.org/job/Lucene-Solr-SmokeRelease-5.5/16/

No tests ran.

Build Log:
[...truncated 39773 lines...]
prepare-release-no-sign:
     [mkdir] Created dir: /x1/jenkins/jenkins-slave/workspace/Lucene-Solr-SmokeRelease-5.5/lucene/build/smokeTestRelease/dist
      [copy] Copying 461 files to /x1/jenkins/jenkins-slave/workspace/Lucene-Solr-SmokeRelease-5.5/lucene/build/smokeTestRelease/dist/lucene
      [copy] Copying 245 files to /x1/jenkins/jenkins-slave/workspace/Lucene-Solr-SmokeRelease-5.5/lucene/build/smokeTestRelease/dist/solr
    [smoker] Java 1.7 JAVA_HOME=/home/jenkins/jenkins-slave/tools/hudson.model.JDK/latest1.7
    [smoker] Java 1.8 JAVA_HOME=/home/jenkins/jenkins-slave/tools/hudson.model.JDK/latest1.8
    [smoker] NOTE: output encoding is UTF-8
    [smoker]
    [smoker] Load release URL "file:/x1/jenkins/jenkins-slave/workspace/Lucene-Solr-SmokeRelease-5.5/lucene/build/smokeTestRelease/dist/"...
    [smoker]
    [smoker] Test Lucene...
    [smoker] test basics...
    [smoker] get KEYS
    [smoker] 0.2 MB in 0.01 sec (16.7 MB/sec)
    [smoker] check changes HTML...
    [smoker] download lucene-5.5.2-src.tgz...
    [smoker] 28.7 MB in 0.03 sec (1008.3 MB/sec)
    [smoker] verify md5/sha1 digests
    [smoker] download lucene-5.5.2.tgz...
    [smoker] 63.4 MB in 0.06 sec (1108.1 MB/sec)
    [smoker] verify md5/sha1 digests
    [smoker] download lucene-5.5.2.zip...
    [smoker] 73.9 MB in 0.07 sec (1127.4 MB/sec)
    [smoker] verify md5/sha1 digests
    [smoker] unpack lucene-5.5.2.tgz...
    [smoker] verify JAR metadata/identity/no javax.* or java.* classes...
    [smoker] test demo with 1.7...
    [smoker] got 6190 hits for query "lucene"
    [smoker] checkindex with 1.7...
    [smoker] test demo with 1.8...
    [smoker] got 6190 hits for query "lucene"
    [smoker] checkindex with 1.8...
    [smoker] check Lucene's javadoc JAR
    [smoker] unpack lucene-5.5.2.zip...
    [smoker] verify JAR metadata/identity/no javax.* or java.* classes...
    [smoker] test demo with 1.7...
    [smoker] got 6190 hits for query "lucene"
    [smoker] checkindex with 1.7...
    [smoker] test demo with 1.8...
    [smoker] got 6190 hits for query "lucene"
    [smoker] checkindex with 1.8...
    [smoker] check Lucene's javadoc JAR
    [smoker] unpack lucene-5.5.2-src.tgz...
    [smoker] make sure no JARs/WARs in src dist...
    [smoker] run "ant validate"
    [smoker] run tests w/ Java 7 and testArgs='-Dtests.slow=false'...
    [smoker]
    [smoker] command "export JAVA_HOME="/home/jenkins/jenkins-slave/tools/hudson.model.JDK/latest1.7" PATH="/home/jenkins/jenkins-slave/tools/hudson.model.JDK/latest1.7/bin:$PATH" JAVACMD="/home/jenkins/jenkins-slave/tools/hudson.model.JDK/latest1.7/bin/java"; ant clean test -Dtests.slow=false" failed:
    [smoker] Buildfile: /x1/jenkins/jenkins-slave/workspace/Lucene-Solr-SmokeRelease-5.5/lucene/build/smokeTestRelease/tmp/unpack/lucene-5.5.2/build.xml
    [smoker]
    [smoker] clean:
    [smoker] [delete] Deleting directory /x1/jenkins/jenkins-slave/workspace/Lucene-Solr-SmokeRelease-5.5/lucene/build/smokeTestRelease/tmp/unpack/lucene-5.5.2/build
    [smoker]
    [smoker] ivy-availability-check:
    [smoker]
    [smoker] ivy-fail:
    [smoker]
    [smoker] ivy-configure:
    [smoker] [ivy:configure] :: Apache Ivy 2.3.0 - 20130110142753 :: http://ant.apache.org/ivy/ ::
    [smoker] [ivy:configure] :: loading settings :: file = /x1/jenkins/jenkins-slave/workspace/Lucene-Solr-SmokeRelease-5.5/lucene/build/smokeTestRelease/tmp/unpack/lucene-5.5.2/ivy-settings.xml
    [smoker]
    [smoker] -clover.load:
    [smoker]
    [smoker] resolve-groovy:
    [smoker] [ivy:cachepath] :: resolving dependencies :: org.codehaus.groovy#groovy-all-caller;working
    [smoker] [ivy:cachepath] confs: [default]
    [smoker] [ivy:cachepath] found org.codehaus.groovy#groovy-all;2.4.4 in public
    [smoker] [ivy:cachepath] :: resolution report :: resolve 182ms :: artifacts dl 2ms
    [smoker] ---------------------------------------------------------------------
    [smoker] | | modules || artifacts |
    [smoker] | conf | number| search|dwnlded|evicted|| number|dwnlded|
    [smoker] ---------------------------------------------------------------------
    [smoker] | default | 1 | 0 | 0 | 0 || 1 | 0 |
    [smoker] ---------------------------------------------------------------------
    [smoker]
    [smoker] -init-totals:
    [smoker]
    [smoker] test-core:
    [smoker]
    [smoker] -clover.disable:
    [smoker]
    [smoker] ivy-availability-check:
    [smoker]
    [smoker] ivy-fail:
    [smoker]
    [smoker] ivy-configure:
    [smoker] [ivy:configure] :: loading settings :: file = /x1/jenkins/jenkins-slave/workspace/Lucene-Solr-SmokeRelease-5.5/lucene/build/smokeTestRelease/tmp/unpack/lucene-5.5.2/ivy-settings.xml
    [smoker]
    [smoker] -clover.load:
    [smoker]
    [smoker] -clover.classpath:
    [smoker]
    [smoker] -clover.setup:
    [smoker]
    [smoker] clover:
    [smoker]
    [smoker] -check-git-state:
    [smoker]
    [smoker] -git-cleanroot:
    [smoker]
    [smoker] -copy-git-state:
    [smoker]
    [smoker] git-autoclean:
    [smoker]
    [smoker] resolve:
    [smoker]
    [smoker] init:
    [smoker]
    [smoker] compile-core:
    [smoker] [mkdir] Created dir: /x1/jenkins/jenkins-slave/workspace/Lucene-Solr-SmokeRelease-5.5/lucene/build/smokeTestRelease/tmp/unpack/lucene-5.5.2/build/core/classes/java
    [smoker] [javac] Compiling 739 source files to /x1/jenkins/jenkins-slave/workspace/Lucene-Solr-SmokeRelease-5.5/lucene/build/smokeTestRelease/tmp/unpack/lucene-5.5.2/build/core/classes/java
    [smoker] [javac] Note: Some input files use or override a deprecated API.
    [smoker] [javac] Note: Recompile with -Xlint:deprecation for details.
    [smoker] [javac] Creating empty /x1/jenkins/jenkins-slave/workspace/Lucene-Solr-SmokeRelease-5.5/lucene/build/smokeTestRelease/tmp/unpack/lucene-5.5.2/build/core/classes/java/org/apache/lucene/codecs/blocktree/package-info.class
    [smoker] [javac] Creating empty /x1/jenkins/jenkins-slave/workspace/Lucene-Solr-SmokeRelease-5.5/lucene/build/smokeTestRelease/tmp/unpack/lucene-5.5.2/build/core/classes/java/org/apache/lucene/codecs/lucene54/package-info.class
    [smoker] [javac] Creating empty /x1/jenkins/jenkins-slave/workspace/Lucene-Solr-SmokeRelease-5.5/lucene/build/smokeTestRelease/tmp/unpack/lucene-5.5.2/build/core/classes/java/org/apache/lucene/util/packed/package-info.class
    [smoker] [javac] Creating empty /x1/jenkins/jenkins-slave/workspace/Lucene-Solr-SmokeRelease-5.5/lucene/build/smokeTestRelease/tmp/unpack/lucene-5.5.2/build/core/classes/java/org/apache/lucene/analysis/package-info.class
    [smoker] [javac] Creating empty /x1/jenkins/jenkins-slave/workspace/Lucene-Solr-SmokeRelease-5.5/lucene/build/smokeTestRelease/tmp/unpack/lucene-5.5.2/build/core/classes/java/org/apache/lucene/document/package-info.class
    [smoker] [javac] Creating empty /x1/jenkins/jenkins-slave/workspace/Lucene-Solr-SmokeRelease-5.5/lucene/build/smokeTestRelease/tmp/unpack/lucene-5.5.2/build/core/classes/java/org/apache/lucene/util/package-info.class
    [smoker] [javac] Creating empty /x1/jenkins/jenkins-slave/workspace/Lucene-Solr-SmokeRelease-5.5/lucene/build/smokeTestRelease/tmp/unpack/lucene-5.5.2/build/core/classes/java/org/apache/lucene/analysis/tokenattributes/package-info.class
    [smoker] [javac] Creating empty /x1/jenkins/jenkins-slave/workspace/Lucene-Solr-SmokeRelease-5.5/lucene/build/smokeTestRelease/tmp/unpack/lucene-5.5.2/build/core/classes/java/org/apache/lucene/codecs/lucene50/package-info.class
    [smoker] [javac] Creating empty /x1/jenkins/jenkins-slave/workspace/Lucene-Solr-SmokeRelease-5.5/lucene/build/smokeTestRelease/tmp/unpack/lucene-5.5.2/build/core/classes/java/org/apache/lucene/index/package-info.class
    [smoker] [javac] Creating empty /x1/jenkins/jenkins-slave/workspace/Lucene-Solr-SmokeRelease-5.5/lucene/build/smokeTestRelease/tmp/unpack/lucene-5.5.2/build/core/classes/java/org/apache/lucene/codecs/compressing/package-info.class
    [smoker] [javac] Creating empty /x1/jenkins/jenkins-slave/workspace/Lucene-Solr-SmokeRelease-5.5/lucene/build/smokeTestRelease/tmp/unpack/lucene-5.5.2/build/core/classes/java/org/apache/lucene/codecs/lucene53/package-info.class
    [smoker] [javac] Creating empty /x1/jenkins/jenkins-slave/workspace/Lucene-Solr-SmokeRelease-5.5/lucene/build/smokeTestRelease/tmp/unpack/lucene-5.5.2/build/core/classes/java/org/apache/lucene/util/automaton/package-info.class
    [smoker] [javac] Creating empty /x1/jenkins/jenkins-slave/workspace/Lucene-Solr-SmokeRelease-5.5/lucene/build/smokeTestRelease/tmp/unpack/lucene-5.5.2/build/core/classes/java/org/apache/lucene/util/fst/package-info.class
    [smoker] [javac] Creating empty /x1/jenkins/jenkins-slave/workspace/Lucene-Solr-SmokeRelease-5.5/lucene/build/smokeTestRelease/tmp/unpack/lucene-5.5.2/build/core/classes/java/org/apache/lucene/util/mutable/package-info.class
    [smoker] [javac] Creating empty /x1/jenkins/jenkins-slave/workspace/Lucene-Solr-SmokeRelease-5.5/lucene/build/smokeTestRelease/tmp/unpack/lucene-5.5.2/build/core/classes/java/org/apache/lucene/search/similarities/package-info.class
    [smoker] [javac] Creating empty /x1/jenkins/jenkins-slave/workspace/Lucene-Solr-SmokeRelease-5.5/lucene/build/smokeTestRelease/tmp/unpack/lucene-5.5.2/build/core/classes/java/org/apache/lucene/codecs/perfield/package-info.class
    [smoker] [javac] Creating empty /x1/jenkins/jenkins-slave/workspace/Lucene-Solr-SmokeRelease-5.5/lucene/build/smokeTestRelease/tmp/unpack/lucene-5.5.2/build/core/classes/java/org/apache/lucene/store/package-info.class
    [smoker] [javac] Creating empty /x1/jenkins/jenkins-slave/workspace/Lucene-Solr-SmokeRelease-5.5/lucene/build/smokeTestRelease/tmp/unpack/lucene-5.5.2/build/core/classes/java/org/apache/lucene/package-info.class
    [smoker] [javac] Creating empty /x1/jenkins/jenkins-slave/workspace/Lucene-Solr-SmokeRelease-5.5/lucene/build/smokeTestRelease/tmp/unpack/lucene-5.5.2/build/core/classes/java/org/apache/lucene/search/package-info.class
    [smoker] [javac] Creating empty /x1/jenkins/jenkins-slave/workspace/Lucene-Solr-SmokeRelease-5.5/lucene/build/smokeTestRelease/tmp/unpack/lucene-5.5.2/build/core/classes/java/org/apache/lucene/codecs/package-info.class
    [smoker] [javac] Creating empty /x1/jenkins/jenkins-slave/workspace/Lucene-Solr-SmokeRelease-5.5/lucene/build/smokeTestRelease/tmp/unpack/lucene-5.5.2/build/core/classes/java/org/apache/lucene/search/spans/package-info.class
    [smoker] [copy] Copying 3 files to /x1/jenkins/jenkins-slave/workspace/Lucene-Solr-SmokeRelease-5.5/lucene/build/smokeTestRelease/tmp/unpack/lucene-5.5.2/build/core/classes/java
    [smoker]
    [smoker] compile-test-framework:
    [smoker]
    [smoker] -check-git-state:
    [smoker]
    [smoker] -git-cleanroot:
    [smoker]
    [smoker] -copy-git-state:
    [smoker]
    [smoker] git-autoclean:
    [smoker]
    [smoker] ivy-availability-check:
    [smoker]
    [smoker] ivy-fail:
    [smoker]
    [smoker] ivy-configure:
    [smoker] [ivy:configure] :: loading settings :: file = /x1/jenkins/jenkins-slave/workspace/Lucene-Solr-SmokeRelease-5.5/lucene/build/smokeTestRelease/tmp/unpack/lucene-5.5.2/ivy-settings.xml
    [smoker]
    [smoker] resolve:
    [smoker]
    [smoker] init:
    [smoker]
    [smoker] compile-lucene-core:
    [smoker]
    [smoker] -check-git-state:
    [smoker]
    [smoker] -git-cleanroot:
    [smoker]
    [smoker] -copy-git-state:
    [smoker]
    [smoker] git-autoclean:
    [smoker]
    [smoker] ivy-availability-check:
    [smoker]
    [smoker] ivy-fail:
    [smoker]
    [smoker] ivy-configure:
    [smoker] [ivy:configure] :: loading settings :: file = /x1/jenkins/jenkins-slave/workspace/Lucene-Solr-SmokeRelease-5.5/lucene/build/smokeTestRelease/tmp/unpack/lucene-5.5.2/ivy-settings.xml
    [smoker]
    [smoker] resolve:
    [smoker]
    [smoker] init:
    [smoker]
    [smoker] -clover.disable:
    [smoker]
    [smoker] -clover.load:
    [smoker]
    [smoker] -clover.classpath:
    [smoker]
    [smoker] -clover.setup:
    [smoker]
    [smoker] clover:
    [smoker]
    [smoker] compile-core:
    [smoker]
    [smoker] compile-codecs:
    [smoker]
    [smoker] -check-git-state:
    [smoker]
    [smoker] -git-cleanroot:
    [smoker]
    [smoker] -copy-git-state:
    [smoker]
    [smoker] git-autoclean:
    [smoker]
    [smoker] ivy-availability-check:
    [smoker]
    [smoker] ivy-fail:
    [smoker]
    [smoker] ivy-configure:
    [smoker] [ivy:configure] :: loading settings :: file = /x1/jenkins/jenkins-slave/workspace/Lucene-Solr-SmokeRelease-5.5/lucene/build/smokeTestRelease/tmp/unpack/lucene-5.5.2/ivy-settings.xml
    [smoker]
    [smoker] resolve:
    [smoker]
    [smoker] common.init:
    [smoker]
    [smoker] compile-lucene-core:
    [smoker]
    [smoker] init:
    [smoker]
    [smoker] -clover.disable:
    [smoker]
    [smoker] -clover.load:
    [smoker]
    [smoker] -clover.classpath:
    [smoker]
    [smoker] -clover.setup:
    [smoker]
    [smoker] clover:
    [smoker]
    [smoker] compile-core:
    [smoker] [mkdir] Created dir: /x1/jenkins/jenkins-slave/workspace/Lucene-Solr-SmokeRelease-5.5/lucene/build/smokeTestRelease/tmp/unpack/lucene-5.5.2/build/codecs/classes/java
    [smoker] [javac] Compiling 64 source files to /x1/jenkins/jenkins-slave/workspace/Lucene-Solr-SmokeRelease-5.5/lucene/build/smokeTestRelease/tmp/unpack/lucene-5.5.2/build/codecs/classes/java
    [smoker] [javac] Note: Some input files use or override a deprecated API.
    [smoker] [javac] Note: Recompile with -Xlint:deprecation for details.
    [smoker] [javac] Creating empty /x1/jenkins/jenkins-slave/workspace/Lucene-Solr-SmokeRelease-5.5/lucene/build/smokeTestRelease/tmp/unpack/lucene-5.5.2/build/codecs/classes/java/org/apache/lucene/codecs/blocktreeords/package-info.class
    [smoker] [javac] Creating empty /x1/jenkins/jenkins-slave/workspace/Lucene-Solr-SmokeRelease-5.5/lucene/build/smokeTestRelease/tmp/unpack/lucene-5.5.2/build/codecs/classes/java/org/apache/lucene/codecs/memory/package-info.class
    [smoker] [javac] Creating empty /x1/jenkins/jenkins-slave/workspace/Lucene-Solr-SmokeRelease-5.5/lucene/build/smokeTestRelease/tmp/unpack/lucene-5.5.2/build/codecs/classes/java/org/apache/lucene/codecs/simpletext/package-info.class
    [smoker] [javac] Creating empty /x1/jenkins/jenkins-slave/workspace/Lucene-Solr-SmokeRelease-5.5/lucene/build/smokeTestRelease/tmp/unpack/lucene-5.5.2/build/codecs/classes/java/org/apache/lucene/codecs/blockterms/package-info.class
    [smoker] [javac] Creating empty /x1/jenkins/jenkins-slave/workspace/Lucene-Solr-SmokeRelease-5.5/lucene/build/smokeTestRelease/tmp/unpack/lucene-5.5.2/build/codecs/classes/java/org/apache/lucene/codecs/bloom/package-info.class
    [smoker] [javac] Creating empty /x1/jenkins/jenkins-slave/workspace/Lucene-Solr-SmokeRelease-5.5/lucene/build/smokeTestRelease/tmp/unpack/lucene-5.5.2/build/codecs/classes/java/org/apache/lucene/codecs/autoprefix/package-info.class
    [smoker] [copy] Copying 3 files to /x1/jenkins/jenkins-slave/workspace/Lucene-Solr-SmokeRelease-5.5/lucene/build/smokeTestRelease/tmp/unpack/lucene-5.5.2/build/codecs/classes/java
    [smoker]
    [smoker] -clover.disable:
    [smoker]
    [smoker] -clover.load:
    [smoker]
    [smoker] -clover.classpath:
    [smoker]
    [smoker] -clover.setup:
    [smoker]
    [smoker] clover:
    [smoker]
    [smoker] common.compile-core:
    [smoker] [mkdir] Created dir: /x1/jenkins/jenkins-slave/workspace/Lucene-Solr-SmokeRelease-5.5/lucene/build/smokeTestRelease/tmp/unpack/lucene-5.5.2/build/test-framework/classes/java
    [smoker] [javac] Compiling 174 source files to /x1/jenkins/jenkins-slave/workspace/Lucene-Solr-SmokeRelease-5.5/lucene/build/smokeTestRelease/tmp/unpack/lucene-5.5.2/build/test-framework/classes/java
    [smoker] [javac] Note: Some input files use or override a deprecated API.
    [smoker] [javac] Note: Recompile with -Xlint:deprecation for details.
    [smoker] [javac] Creating empty /x1/jenkins/jenkins-slave/workspace/Lucene-Solr-SmokeRelease-5.5/lucene/build/smokeTestRelease/tmp/unpack/lucene-5.5.2/build/test-framework/classes/java/org/apache/lucene/mockfile/package-info.class
    [smoker] [javac] Creating empty /x1/jenkins/jenkins-slave/workspace/Lucene-Solr-SmokeRelease-5.5/lucene/build/smokeTestRelease/tmp/unpack/lucene-5.5.2/build/test-framework/classes/java/org/apache/lucene/codecs/cranky/package-info.class
    [smoker] [javac] Creating empty /x1/jenkins/jenkins-slave/workspace/Lucene-Solr-SmokeRelease-5.5/lucene/build/smokeTestRelease/tmp/unpack/lucene-5.5.2/build/test-framework/classes/java/org/apache/lucene/codecs/compressing/dummy/package-info.class
    [smoker] [javac] Creating empty /x1/jenkins/jenkins-slave/workspace/Lucene-Solr-SmokeRelease-5.5/lucene/build/smokeTestRelease/tmp/unpack/lucene-5.5.2/build/test-framework/classes/java/org/apache/lucene/codecs/asserting/package-info.class
    [smoker] [javac] Creating empty /x1/jenkins/jenkins-slave/workspace/Lucene-Solr-SmokeRelease-5.5/lucene/build/smokeTestRelease/tmp/unpack/lucene-5.5.2/build/test-framework/classes/java/org/apache/lucene/codecs/ramonly/package-info.class
    [smoker] [javac] Creating empty /x1/jenkins/jenkins-slave/workspace/Lucene-Solr-SmokeRelease-5.5/lucene/build/smokeTestRelease/tmp/unpack/lucene-5.5.2/build/test-framework/classes/java/org/apache/lucene/codecs/cheapbastard/package-info.class
    [smoker] [javac] Creating empty /x1/jenkins/jenkins-slave/workspace/Lucene-Solr-SmokeRelease-5.5/lucene/build/smokeTestRelease/tmp/unpack/lucene-5.5.2/build/test-framework/classes/java/org/apache/lucene/codecs/mockrandom/package-info.class
    [smoker] [copy] Copying 4 files to /x1/jenkins/jenkins-slave/workspace/Lucene-Solr-SmokeRelease-5.5/lucene/build/smokeTestRelease/tmp/unpack/lucene-5.5.2/build/test-framework/classes/java
    [smoker]
    [smoker] compile-core:
    [smoker]
    [smoker] compile-test:
    [smoker] [mkdir] Created dir: /x1/jenkins/jenkins-slave/workspace/Lucene-Solr-SmokeRelease-5.5/lucene/build/smokeTestRelease/tmp/unpack/lucene-5.5.2/build/core/classes/test
    [smoker] [javac] Compiling 430 source files to /x1/jenkins/jenkins-slave/workspace/Lucene-Solr-SmokeRelease-5.5/lucene/build/smokeTestRelease/tmp/unpack/lucene-5.5.2/build/core/classes/test
    [smoker] [javac] Note: Some input files use or override a deprecated API.
    [smoker] [javac] Note: Recompile with -Xlint:deprecation for details.
    [smoker] [copy] Copying 3 files to /x1/jenkins/jenkins-slave/workspace/Lucene-Solr-SmokeRelease-5.5/lucene/build/smokeTestRelease/tmp/unpack/lucene-5.5.2/build/core/classes/test
    [smoker]
    [smoker] install-junit4-taskdef:
    [smoker]
    [smoker] validate:
    [smoker]
    [smoker] resolve-groovy:
    [smoker]
    [smoker] -init-totals:
    [smoker]
    [smoker] -test:
    [smoker] [mkdir] Created dir: /x1/jenkins/jenkins-slave/workspace/Lucene-Solr-SmokeRelease-5.5/lucene/build/smokeTestRelease/tmp/unpack/lucene-5.5.2/build/core/test
    [smoker] [loadresource] Do not set property tests.explicitclass as its length is 0.
    [smoker] [mkdir] Created dir: /x1/jenkins/jenkins-slave/workspace/Lucene-Solr-SmokeRelease-5.5/lucene/build/smokeTestRelease/tmp/unpack/lucene-5.5.2/build/core/test/temp
    [smoker] [mkdir] Created dir: /x1/jenkins/jenkins-slave/workspace/Lucene-Solr-SmokeRelease-5.5/lucene/build/smokeTestRelease/tmp/unpack/.caches/test-stats/core
    [smoker] [junit4] <JUnit4> says cześć! Master seed: 3CAB6CBA18152C51
    [smoker] [junit4] Executing 422 suites with 3 JVMs.
    [smoker] [junit4]
    [smoker] [junit4] Started J0 PID(30990@localhost).
    [smoker] [junit4] Started J2 PID(30991@localhost).
    [smoker] [junit4] Started J1 PID(30996@localhost).
    [smoker] [junit4] Suite: org.apache.lucene.search.TestTotalHitCountCollector
    [smoker] [junit4] Completed [1/422] on J0 in 2.32s, 1 test
    [smoker] [junit4]
    [smoker] [junit4] Suite: org.apache.lucene.search.spans.TestSpansAdvanced
    [smoker] [junit4] Completed [2/422] on J0 in 0.95s, 1 test
    [smoker] [junit4]
    [smoker] [junit4] Suite: org.apache.lucene.index.TestStressIndexing2
    [smoker] [junit4] Completed [3/422] on J1 in 5.82s, 3 tests
    [smoker] [junit4]
    [smoker] [junit4] Suite: org.apache.lucene.index.TestIndexableField
    [smoker] [junit4] Completed [4/422] on J2 in 5.73s, 2 tests
    [smoker] [junit4]
    [smoker] [junit4] Suite: org.apache.lucene.index.TestDirectoryReaderReopen
    [smoker] [junit4] Completed [5/422] on J1 in 7.42s, 9 tests
    [smoker] [junit4]
    [smoker] [junit4] Suite: org.apache.lucene.search.TestTimeLimitingCollector
    [smoker] [junit4] Completed [6/422] on J0 in 14.10s, 7 tests
    [smoker] [junit4]
    [smoker] [junit4] Suite: org.apache.lucene.search.spans.TestFieldMaskingSpanQuery
    [smoker] [junit4] Completed [7/422] on J1 in 4.41s, 11 tests
    [smoker] [junit4]
    [smoker] [junit4] Suite: org.apache.lucene.util.automaton.TestAutomaton
    [smoker] [junit4] Completed [8/422] on J2 in 16.24s, 56 tests
    [smoker] [junit4]
    [smoker] [junit4] Suite: org.apache.lucene.store.TestByteArrayDataInput
    [smoker] [junit4] Completed [9/422] on J2 in 0.37s, 1 test
    [smoker] [junit4]
    [smoker] [junit4] Suite: org.apache.lucene.index.TestInfoStream
    [smoker] [junit4] Completed [10/422] on J2 in 0.18s, 2 tests
    [smoker] [junit4]
    [smoker] [junit4] Suite: org.apache.lucene.index.TestCrashCausesCorruptIndex
    [smoker] [junit4] Completed [11/422] on J2 in 0.98s, 1 test
    [smoker] [junit4]
    [smoker] [junit4] Suite: org.apache.lucene.util.automaton.TestUTF32ToUTF8
    [smoker] [junit4] Completed [12/422] on J0 in 7.97s, 6 tests
    [smoker] [junit4]
    [smoker] [junit4] Suite: org.apache.lucene.util.TestInPlaceMergeSorter
    [smoker] [junit4] Completed [13/422] on J0 in 1.66s, 9 tests
    [smoker] [junit4]
    [smoker] [junit4] Suite: org.apache.lucene.index.TestLogMergePolicy
    [smoker] [junit4] Completed [14/422] on J0 in 0.41s, 2 tests
    [smoker] [junit4]
    [smoker] [junit4] Suite: org.apache.lucene.index.TestFlushByRamOrCountsPolicy
    [smoker] [junit4] Completed [15/422] on J1 in 12.30s, 5 tests
    [smoker] [junit4]
    [smoker] [junit4] Suite: org.apache.lucene.search.TestMultiCollector
    [smoker] [junit4] Completed [16/422] on J1 in 1.93s, 2 tests
    [smoker] [junit4]
    [smoker] [junit4] Suite: org.apache.lucene.search.TestApproximationSearchEquivalence
    [smoker] [junit4] Completed [17/422] on J0 in 5.65s, 10 tests
    [smoker] [junit4]
    [smoker] [junit4] Suite: org.apache.lucene.index.TestIndexCommit
    [smoker] [junit4] Completed [18/422] on J0 in 0.22s, 1 test
    [smoker] [junit4]
    [smoker] [junit4] Suite: org.apache.lucene.search.TestComplexExplanations
    [smoker] [junit4] Completed [19/422] on J2 in 10.44s, 21 tests
    [smoker] [junit4]
    [smoker] [junit4] Suite: org.apache.lucene.util.automaton.FiniteStringsIteratorTest
    [smoker] [junit4] Completed [20/422] on J0 in 1.78s, 7 tests
    [smoker] [junit4]
    [smoker] [junit4] Suite: org.apache.lucene.search.TestNot
    [smoker] [junit4] Completed [21/422] on J0 in 0.19s, 1 test
    [smoker] [junit4]
    [smoker] [junit4] Suite: org.apache.lucene.search.similarities.TestDefaultSimilarity
    [smoker] [junit4] Completed [22/422] on J0 in 0.08s, 2 tests
    [smoker] [junit4]
    [smoker] [junit4] Suite: org.apache.lucene.index.TestNoDeletionPolicy
    [smoker] [junit4] Completed [23/422] on J0 in 0.46s, 4 tests
    [smoker] [junit4]
    [smoker] [junit4] Suite: org.apache.lucene.util.automaton.TestDeterminizeLexicon
    [smoker] [junit4] Completed [24/422] on J2 in 4.86s, 1 test
    [smoker] [junit4]
    [smoker] [junit4] Suite: org.apache.lucene.store.TestMmapDirectory
    [smoker] [junit4] Completed [25/422] on J0 in 3.12s, 42 tests
    [smoker] [junit4]
    [smoker] [junit4] Suite: org.apache.lucene.index.TestIndexWriterFromReader
    [smoker] [junit4] Completed [26/422] on J0 in 0.85s, 12 tests
    [smoker] [junit4]
    [smoker] [junit4] Suite: org.apache.lucene.search.TestPrefixQuery
    [smoker] [junit4] Completed [27/422] on J1 in 7.96s, 3 tests
    [smoker] [junit4]
    [smoker] [junit4] Suite: org.apache.lucene.index.TestNewestSegment
    [smoker] [junit4] Completed [28/422] on J1 in 0.02s, 1 test
    [smoker] [junit4]
    [smoker] [junit4] Suite: org.apache.lucene.search.TestRegexpQuery
    [smoker] [junit4] Completed [29/422] on J0 in 0.53s, 7 tests
    [smoker] [junit4]
    [smoker] [junit4] Suite: org.apache.lucene.search.TestUsageTrackingFilterCachingPolicy
    [smoker] [junit4] Completed [30/422] on J1 in 0.67s, 2 tests
    [smoker] [junit4]
    [smoker] [junit4] Suite: org.apache.lucene.search.TestDateFilter
    [smoker] [junit4] Completed [31/422] on J0 in 0.19s, 2 tests
    [smoker] [junit4]
    [smoker] [junit4] Suite: org.apache.lucene.search.TestCachingWrapperQuery
    [smoker] [junit4] Completed [32/422] on J2 in 2.09s, 7 tests
    [smoker] [junit4]
    [smoker] [junit4] Suite: org.apache.lucene.index.TestSameTokenSamePosition
    [smoker] [junit4] Completed [33/422] on J2 in 0.13s, 2 tests
    [smoker] [junit4]
    [smoker] [junit4] Suite: org.apache.lucene.index.TestTerms
    [smoker] [junit4] Completed [34/422] on J1 in 0.88s, 8 tests
    [smoker] [junit4]
    [smoker] [junit4] Suite: org.apache.lucene.index.TestFieldsReader
    [smoker] [junit4] Completed [35/422] on J1 in 1.08s, 2 tests
    [smoker] [junit4]
    [smoker] [junit4] Suite: org.apache.lucene.search.spans.TestSpans
    [smoker] [junit4] Completed [36/422] on J2 in 1.66s, 26 tests
    [smoker] [junit4]
    [smoker] [junit4] Suite: org.apache.lucene.index.TestLazyProxSkipping
    [smoker] [junit4] Completed [37/422] on J1 in 1.13s, 2 tests
    [smoker] [junit4]
    [smoker] [junit4] Suite: org.apache.lucene.util.TestSetOnce
    [smoker] [junit4] Completed [38/422] on J1 in 0.16s, 4 tests
    [smoker] [junit4]
    [smoker] [junit4] Suite: org.apache.lucene.index.TestDocValuesIndexing
    [smoker] [junit4] Completed [39/422] on J1 in 2.15s, 34 tests
    [smoker] [junit4]
    [smoker] [junit4] Suite: org.apache.lucene.index.TestIndexWriterOutOfFileDescriptors
    [smoker] [junit4] Completed [40/422] on J0 in 11.18s, 1 test
    [smoker] [junit4]
    [smoker] [junit4] Suite: org.apache.lucene.index.TestIndexWriterMerging
    [smoker] [junit4] IGNOR/A 0.02s J2 | TestIndexWriterMerging.testNoWaitClose
    [smoker] [junit4] > Assumption #1: 'slow' test group is disabled (@Slow())
    [smoker] [junit4] Completed [41/422] on J2 in 9.26s, 6 tests, 1 skipped
    [smoker] [junit4]
    [smoker] [junit4] Suite: org.apache.lucene.index.TestDocumentsWriterDeleteQueue
    [smoker] [junit4] Completed [42/422] on J0 in 0.97s, 5 tests
    [smoker] [junit4]
    [smoker] [junit4] Suite: org.apache.lucene.index.Test2BPostings
    [smoker] [junit4] IGNOR/A 0.01s J0 | Test2BPostings.test
    [smoker] [junit4] > Assumption #1: 'nightly' test group is disabled (@Nightly())
    [smoker] [junit4] Completed [43/422] on J0 in 0.03s, 1 test, 1 skipped
    [smoker] [junit4]
    [smoker] [junit4] Suite: org.apache.lucene.index.TestTransactions
    [smoker] [junit4] Completed [44/422] on J2 in 1.78s, 1 test
    [smoker] [junit4]
    [smoker] [junit4] Suite: org.apache.lucene.index.TestParallelCompositeReader
    [smoker] [junit4] Completed [45/422] on J2 in 1.17s, 16 tests
    [smoker] [junit4]
    [smoker] [junit4] Suite: org.apache.lucene.search.TestBooleanScorer
    [smoker] [junit4] Completed [46/422] on J0 in 11.86s, 5 tests
    [smoker] [junit4]
    [smoker] [junit4] Suite: org.apache.lucene.search.TestSimilarityProvider
    [smoker] [junit4] Completed [47/422] on J0 in 0.10s, 1 test
    [smoker] [junit4]
    [smoker] [junit4] Suite: org.apache.lucene.codecs.TestCodecLoadingDeadlock
    [smoker] [junit4] Completed [48/422] on J0 in 0.73s, 1 test
    [smoker] [junit4]
    [smoker] [junit4] Suite: org.apache.lucene.search.TestSortRescorer
    [smoker] [junit4] Completed [49/422] on J0 in 3.53s, 2 tests
    [smoker] [junit4]
    [smoker] [junit4] Suite: org.apache.lucene.search.TestSort
    [smoker] [junit4] Completed [50/422] on J0 in 0.82s, 25 tests
    [smoker] [junit4]
    [smoker] [junit4] Suite: org.apache.lucene.search.TestConstantScoreQuery
    [smoker] [junit4] Completed [51/422] on J0 in 0.50s, 6 tests
    [smoker] [junit4]
    [smoker] [junit4] Suite: org.apache.lucene.index.TestIndexWriterMergePolicy
    [smoker] [junit4] Completed [52/422] on J0 in 8.65s, 7 tests
    [smoker] [junit4]
    [smoker] [junit4] Suite: org.apache.lucene.index.TestIndexWriterExceptions
    [smoker] [junit4] IGNOR/A 0.03s J1 | TestIndexWriterExceptions.testTooManyTokens
    [smoker] [junit4] > Assumption #1: 'nightly' test group is disabled (@Nightly())
    [smoker] [junit4] Completed [53/422] on J1 in 33.44s, 36 tests, 1 skipped
    [smoker] [junit4]
    [smoker] [junit4] Suite: org.apache.lucene.util.TestNumericUtils
    [smoker] [junit4] Completed [54/422] on J0 in 3.07s, 12 tests
    [smoker] [junit4]
    [smoker] [junit4] Suite: org.apache.lucene.util.TestOfflineSorter
    [smoker] [junit4] IGNOR/A 0.00s J2 | TestOfflineSorter.testLargerRandom
    [smoker] [junit4] > Assumption #1: 'nightly' test group is disabled (@Nightly())
    [smoker] [junit4] Completed [55/422] on J2 in 27.93s, 7 tests, 1 skipped
    [smoker] [junit4]
    [smoker] [junit4] Suite: org.apache.lucene.search.TestSimpleSearchEquivalence
    [smoker] [junit4] Completed [56/422] on J2 in 3.06s, 16 tests
    [smoker] [junit4]
    [smoker] [junit4] Suite: org.apache.lucene.codecs.lucene50.TestBlockPostingsFormat2
    [smoker] [junit4] Completed [57/422] on J0 in 6.61s, 4 tests
    [smoker] [junit4]
    [smoker] [junit4] Suite: org.apache.lucene.codecs.perfield.TestPerFieldPostingsFormat2
    [smoker] [junit4] Completed [58/422] on J2 in 6.82s, 5 tests
    [smoker] [junit4]
    [smoker] [junit4] Suite: org.apache.lucene.search.TestScorerPerf
    [smoker] [junit4] Completed [59/422] on J1 in 13.52s, 1 test
    [smoker] [junit4]
    [smoker] [junit4] Suite: org.apache.lucene.index.TestTermdocPerf
    [smoker] [junit4] Completed [60/422] on J2 in 0.10s, 1 test
    [smoker] [junit4]
    [smoker] [junit4] Suite: org.apache.lucene.util.TestMathUtil
    [smoker] [junit4] Completed [61/422] on J2 in 0.16s, 5 tests
    [smoker] [junit4]
    [smoker] [junit4] Suite: org.apache.lucene.index.TestMaxPosition
    [smoker] [junit4] Completed [62/422] on J2 in 0.40s, 2 tests
    [smoker] [junit4]
    [smoker] [junit4] Suite: org.apache.lucene.search.TestMinShouldMatch2
    [smoker] [junit4] Completed [63/422] on J0 in 8.12s, 6 tests
    [smoker] [junit4]
    [smoker] [junit4] Suite: org.apache.lucene.search.TestBooleanRewrites
    [smoker] [junit4] Completed [64/422] on J0 in 3.08s, 7 tests
    [smoker] [junit4]
    [smoker] [junit4] Suite: org.apache.lucene.util.automaton.TestOperations
    [smoker] [junit4] Completed [65/422] on J0 in 2.99s, 5 tests
    [smoker] [junit4]
    [smoker] [junit4] Suite: org.apache.lucene.util.TestSloppyMath
    [smoker] [junit4] Completed [66/422] on J0 in 0.21s, 3 tests
    [smoker] [junit4]
    [smoker] [junit4] Suite: org.apache.lucene.index.TestParallelTermEnum
    [smoker] [junit4] Completed [67/422] on J0 in 0.20s, 1 test
    [smoker] [junit4]
    [smoker] [junit4] Suite: org.apache.lucene.index.Test2BPositions
    [smoker] [junit4] IGNOR/A 0.00s J0 | Test2BPositions.test
    [smoker] [junit4] > Assumption #1: 'monster' test group is disabled (@Monster(value=uses lots of space and takes a few minutes))
    [smoker] [junit4] Completed [68/422] on J0 in 0.01s, 1 test, 1 skipped
    [smoker] [junit4]
    [smoker] [junit4] Suite: org.apache.lucene.util.TestWeakIdentityMap
    [smoker] [junit4] Completed [69/422] on J1 in 10.15s, 2 tests
    [smoker] [junit4]
    [smoker] [junit4] Suite: org.apache.lucene.search.spans.TestSpanMultiTermQueryWrapper
    [smoker] [junit4] Completed [70/422] on J1 in 0.38s, 9 tests
    [smoker] [junit4]
    [smoker] [junit4] Suite: org.apache.lucene.index.TestExitableDirectoryReader
    [smoker] [junit4] Completed [71/422] on J0 in 0.47s, 1 test
    [smoker] [junit4]
    [smoker] [junit4] Suite: org.apache.lucene.search.TestPhrasePrefixQuery
    [smoker] [junit4] Completed [72/422] on J0 in 0.08s, 1 test
    [smoker] [junit4]
    [smoker] [junit4] Suite: org.apache.lucene.index.TestBagOfPostings
    [smoker] [junit4] Completed [73/422] on J2 in 11.12s, 1 test
    [smoker] [junit4]
    [smoker] [junit4] Suite: org.apache.lucene.search.TestSearcherManager
    [smoker] [junit4] Completed [74/422] on J0 in 6.55s, 10 tests
    [smoker] [junit4]
    [smoker] [junit4] Suite: org.apache.lucene.search.similarities.TestSimilarityBase
    [smoker] [junit4] Completed [75/422] on J2 in 7.15s, 32 tests
    [smoker] [junit4]
    [smoker] [junit4] Suite: org.apache.lucene.TestSearch
    [smoker] [junit4] Completed [76/422] on J2 in 0.35s, 2 tests
    [smoker] [junit4]
    [smoker] [junit4] Suite: org.apache.lucene.store.TestRAMDirectory
    [smoker] [junit4] IGNOR/A 0.01s J0 | TestRAMDirectory.testFsyncDoesntCreateNewFiles
    [smoker] [junit4] > Assumption #1: test only works for FSDirectory subclasses
    [smoker] [junit4] Completed [77/422] on J0 in 2.83s, 46 tests, 1 skipped
    [smoker] [junit4]
    [smoker] [junit4] Suite: org.apache.lucene.index.Test2BNumericDocValues
    [smoker] [junit4] IGNOR/A 0.00s J0 | Test2BNumericDocValues.testNumerics
    [smoker] [junit4] > Assumption #1: 'monster' test group is disabled (@Monster(value=takes ~ 2 hours if the heap is 5gb))
    [smoker] [junit4] Completed [78/422] on J0 in 0.00s, 1 test, 1 skipped
    [smoker] [junit4]
    [smoker] [junit4] Suite: org.apache.lucene.search.TestAutomatonQuery
    [smoker] [junit4] Completed [79/422] on J2 in 2.77s, 8 tests
    [smoker] [junit4]
    [smoker] [junit4] Suite: org.apache.lucene.search.TestMultiTermConstantScore
    [smoker] [junit4] Completed [80/422] on J0 in 4.51s, 8 tests
    [smoker] [junit4]
    [smoker] [junit4] Suite: org.apache.lucene.search.TestBooleanMinShouldMatch
    [smoker] [junit4] Completed [81/422] on J1 in 14.42s, 17 tests
    [smoker] [junit4]
    [smoker] [junit4] Suite: org.apache.lucene.search.TestNeedsScores
    [smoker] [junit4] Completed [82/422] on J1 in 0.18s, 5 tests
    [smoker] [junit4]
    [smoker] [junit4] Suite: org.apache.lucene.index.TestConsistentFieldNumbers
    [smoker] [junit4] Completed [83/422] on J2 in 6.29s, 4 tests
    [smoker] [junit4]
    [smoker] [junit4] Suite: org.apache.lucene.search.spans.TestBasics
    [smoker] [junit4] Completed [84/422] on J1 in 10.25s, 25 tests
    [smoker] [junit4]
    [smoker] [junit4] Suite: org.apache.lucene.store.TestLockFactory
    [smoker] [junit4] Completed [85/422] on J1 in 0.06s, 2 tests
    [smoker] [junit4]
    [smoker] [junit4] Suite: org.apache.lucene.analysis.tokenattributes.TestBytesRefAttImpl
    [smoker] [junit4] Completed [86/422] on J1 in 0.03s, 1 test
    [smoker] [junit4]
    [smoker] [junit4] Suite: org.apache.lucene.index.TestTermVectorsReader
    [smoker] [junit4] Completed [87/422] on J1 in 0.17s, 6 tests
    [smoker] [junit4]
    [smoker] [junit4] Suite: org.apache.lucene.codecs.lucene50.TestLucene50StoredFieldsFormat
    [smoker] [junit4] IGNOR/A 0.00s J0 | TestLucene50StoredFieldsFormat.testRamBytesUsed
    [smoker] [junit4] > Assumption #1: 'slow' test group is disabled (@Slow())
    [smoker] [junit4] IGNOR/A 0.00s J0 | TestLucene50StoredFieldsFormat.testBigDocuments
    [smoker] [junit4] > Assumption #1: 'nightly' test group is disabled (@Nightly())
    [smoker] [junit4] Completed [88/422] on J0 in 13.07s, 17 tests, 2 skipped
    [smoker] [junit4]
    [smoker] [junit4] Suite: org.apache.lucene.util.TestQueryBuilder
    [smoker] [junit4] Completed [89/422] on J0 in 0.16s, 20 tests
    [smoker] [junit4]
    [smoker] [junit4] Suite: org.apache.lucene.index.TestSnapshotDeletionPolicy
    [smoker] [junit4] Completed [90/422] on J0 in 1.48s, 7 tests
    [smoker] [junit4]
    [smoker] [junit4] Suite: org.apache.lucene.util.TestBitDocIdSetBuilder
    [smoker] [junit4] Completed [91/422] on J0 in 0.35s, 6 tests
    [smoker] [junit4]
    [smoker] [junit4] Suite: org.apache.lucene.util.TestIntsRef
    [smoker] [junit4] Completed [92/422] on J0 in 0.05s, 2 tests
    [smoker] [junit4]
    [smoker] [junit4] Suite: org.apache.lucene.index.TestIndexWriterReader
    [smoker] [junit4] IGNOR/A 0.00s J2 | TestIndexWriterReader.testDuringAddIndexes
    [smoker] [junit4] > Assumption #1: 'nightly' test group is disabled (@Nightly())
    [smoker] [junit4] IGNOR/A 0.00s J2 | TestIndexWriterReader.testAddIndexesAndDoDeletesThreads
    [smoker] [junit4] > Assumption #1: 'slow' test group is disabled (@Slow())
    [smoker] [junit4] Completed [93/422] on J2 in 13.37s, 23 tests, 2 skipped
    [smoker] [junit4]
    [smoker] [junit4] Suite: org.apache.lucene.index.TestIndexWriterLockRelease
    [smoker] [junit4] Completed [94/422] on J2 in 0.08s, 1 test
    [smoker] [junit4]
    [smoker] [junit4] Suite: org.apache.lucene.util.TestBytesRef
    [smoker] [junit4] Completed [95/422] on J2 in 0.03s, 3 tests
    [smoker] [junit4]
    [smoker] [junit4] Suite: org.apache.lucene.search.TestConjunctions
    [smoker] [junit4] Completed [96/422] on J2 in 0.05s, 1 test
    [smoker] [junit4]
    [smoker] [junit4] Suite: org.apache.lucene.index.TestTermsEnum2
    [smoker] [junit4] Completed [97/422] on J1 in 6.68s, 4 tests
    [smoker] [junit4]
    [smoker] [junit4] Suite: org.apache.lucene.index.TestDuelingCodecsAtNight
    [smoker] [junit4] IGNOR/A 0.00s J1 | TestDuelingCodecsAtNight.testEquals
    [smoker] [junit4] > Assumption #1: 'nightly' test group is disabled (@Nightly())
    [smoker] [junit4] IGNOR/A 0.00s J1 | TestDuelingCodecsAtNight.testBigEquals
    [smoker] [junit4] > Assumption #1: 'nightly' test group is disabled (@Nightly())
    [smoker] [junit4] IGNOR/A 0.00s J1 | TestDuelingCodecsAtNight.testCrazyReaderEquals
    [smoker] [junit4] > Assumption #1: 'nightly' test group is disabled (@Nightly())
    [smoker] [junit4] Completed [98/422] on J1 in 0.01s, 3 tests, 3 skipped
    [smoker] [junit4]
    [smoker] [junit4] Suite: org.apache.lucene.util.TestIntroSorter
    [smoker] [junit4] Completed [99/422] on J2 in 2.63s, 9 tests
    [smoker] [junit4]
    [smoker] [junit4] Suite: org.apache.lucene.search.TestDisjunctionMaxQuery
    [smoker] [junit4] Completed [100/422] on J1 in 1.75s, 12 tests
    [smoker] [junit4]
    [smoker] [junit4] Suite: org.apache.lucene.index.TestFlex
    [smoker] [junit4] Completed [101/422] on J1 in 1.04s, 2 tests
    [smoker] [junit4]
    [smoker] [junit4] Suite: org.apache.lucene.TestExternalCodecs
    [smoker] [junit4] Completed [102/422] on J2 in 2.39s, 1 test
    [smoker] [junit4]
    [smoker] [junit4] Suite: org.apache.lucene.document.TestFieldType
    [smoker] [junit4] Completed [103/422] on J2 in 0.10s, 2 tests
    [smoker] [junit4]
    [smoker] [junit4] Suite: org.apache.lucene.util.TestBytesRefHash
    [smoker] [junit4] Completed [104/422] on J0 in 7.93s, 8 tests
    [smoker] [junit4]
    [smoker] [junit4] Suite: org.apache.lucene.util.TestLSBRadixSorter
    [smoker] [junit4] Completed [105/422] on J0 in 0.14s, 6 tests
    [smoker] [junit4]
    [smoker] [junit4] Suite: org.apache.lucene.analysis.TestToken
    [smoker] [junit4] Completed [106/422] on J0 in 0.06s, 5 tests
    [smoker] [junit4]
    [smoker] [junit4] Suite: org.apache.lucene.util.TestFrequencyTrackingRingBuffer
    [smoker] [junit4] Completed [107/422] on J2 in 1.55s, 2 tests
    [smoker] [junit4]
    [smoker] [junit4] Suite: org.apache.lucene.search.MultiCollectorTest
    [smoker] [junit4] Completed [108/422] on J2 in 0.16s, 4 tests
    [smoker] [junit4]
    [smoker] [junit4] Suite: org.apache.lucene.util.TestCharsRef
    [smoker] [junit4] Completed [109/422] on J2 in 0.11s, 5 tests
    [smoker] [junit4]
    [smoker] [junit4] Suite: org.apache.lucene.analysis.tokenattributes.TestCharTermAttributeImpl
    [smoker] [junit4] Completed [110/422] on J0 in 1.05s, 12 tests
    [smoker] [junit4]
    [smoker] [junit4] Suite: org.apache.lucene.search.TestDateSort
    [smoker] [junit4] Completed [111/422] on J0 in 0.33s, 1 test
    [smoker] [junit4]
    [smoker] [junit4] Suite: org.apache.lucene.index.Test2BSortedDocValuesFixedSorted
    [smoker] [junit4] IGNOR/A 0.00s J0 | Test2BSortedDocValuesFixedSorted.testFixedSorted
    [smoker] [junit4] > Assumption #1: 'monster' test group is disabled (@Monster(value=Takes ~ 6 hours if the heap is 5gb))
    [smoker] [junit4] Completed [112/422] on J0 in 0.01s, 1 test, 1 skipped
    [smoker] [junit4]
    [smoker] [junit4] Suite: org.apache.lucene.util.TestSparseFixedBitDocIdSet
    [smoker] [junit4] Completed [113/422] on J1 in 6.16s, 5 tests
    [smoker] [junit4]
    [smoker] [junit4] Suite: org.apache.lucene.util.TestSmallFloat
    [smoker] [junit4] Completed [114/422] on J1 in 0.23s, 2 tests
    [smoker] [junit4]
    [smoker] [junit4] Suite: org.apache.lucene.index.TestCustomNorms
    [smoker] [junit4] Completed [115/422] on J0 in 2.17s, 1 test
    [smoker] [junit4]
    [smoker] [junit4] Suite: org.apache.lucene.index.TestReaderClosed
    [smoker] [junit4] Completed [116/422] on J1 in 0.08s, 2 tests
    [smoker] [junit4]
    [smoker] [junit4] Suite: org.apache.lucene.index.TestCodecs
    [smoker] [junit4] Completed [117/422] on J1 in 1.74s, 3 tests
    [smoker] [junit4]
    [smoker] [junit4] Suite: org.apache.lucene.index.TestIndexWriterOnDiskFull
    [smoker] [junit4] Completed [118/422] on J1 in 1.70s, 4 tests
    [smoker] [junit4]
    [smoker] [junit4] Suite: org.apache.lucene.index.TestDirectoryReader
    [smoker] [junit4] Completed [119/422] on J0 in 5.00s, 24 tests
    [smoker] [junit4]
    [smoker] [junit4] Suite: org.apache.lucene.index.TestLongPostings
    [smoker] [junit4] Completed [120/422] on J2 in 9.05s, 2 tests
    [smoker] [junit4]
    [smoker] [junit4] Suite: org.apache.lucene.index.TestIndexWriterThreadsToSegments
    [smoker] [junit4] Completed [121/422] on J1 in 7.67s, 4 tests
    [smoker] [junit4]
    [smoker] [junit4] Suite: org.apache.lucene.index.TestMixedCodecs
    [smoker] [junit4] Completed [122/422] on J0 in 7.41s, 1 test
    [smoker] [junit4]
    [smoker] [junit4] Suite: org.apache.lucene.index.TestDocValues
    [smoker] [junit4] Completed [123/422] on J0 in 0.19s, 7 tests
    [smoker] [junit4]
    [smoker] [junit4] Suite: org.apache.lucene.index.TestManyFields
    [smoker] [junit4] Completed [125/422] on J1 in 1.85s, 3 tests
    [smoker] [junit4]
    [smoker] [junit4] Suite: org.apache.lucene.util.TestDocIdSetBuilder
    [smoker] [junit4] Completed [126/422] on J0 in 3.14s, 5 tests
    [smoker] [junit4]
    [smoker] [junit4] Suite: org.apache.lucene.index.TestSumDocFreq
    [smoker] [junit4] Completed [127/422] on J0 in 0.58s, 1 test
    [smoker] [junit4]
    [smoker] [junit4] Suite: org.apache.lucene.index.TestNoMergeScheduler
    [smoker] [junit4] Completed [128/422] on J0 in 0.07s, 3 tests
    [smoker] [junit4]
    [smoker] [junit4] Suite: org.apache.lucene.codecs.lucene50.TestBlockPostingsFormat3
    [smoker] [junit4] Completed [129/422] on J1 in 5.94s, 1 test
    [smoker] [junit4]
    [smoker] [junit4] Suite: org.apache.lucene.index.TestRollback
    [smoker] [junit4] Completed [130/422] on J1 in 0.05s, 1 test
    [smoker] [junit4]
    [smoker] [junit4] Suite: org.apache.lucene.search.TestCustomSearcherSort
    [smoker] [junit4] Completed [131/422] on J0 in 3.08s, 2 tests
    [smoker] [junit4]
    [smoker] [junit4] Suite: org.apache.lucene.search.TestElevationComparator
    [smoker] [junit4] Completed [132/422] on J0 in 0.05s, 1 test
    [smoker] [junit4]
    [smoker] [junit4] Suite: org.apache.lucene.search.TestPrefixInBooleanQuery
    [smoker] [junit4] Completed [133/422] on J0 in 0.40s, 4 tests
    [smoker] [junit4]
    [smoker] [junit4] Suite: org.apache.lucene.search.TestMultiset
    [smoker] [junit4] Completed [134/422] on J0 in 0.07s, 2 tests
    [smoker] [junit4]
    [smoker] [junit4] Suite: org.apache.lucene.TestDemo
    [smoker] [junit4] Completed [135/422] on J0 in 0.24s, 1 test
    [smoker] [junit4]
    [smoker] [junit4] Suite: org.apache.lucene.index.TestMultiFields
    [smoker] [junit4] Completed [136/422] on J0 in 1.04s, 3 tests
    [smoker] [junit4]
    [smoker] [junit4] Suite: org.apache.lucene.store.TestRateLimiter
    [smoker] [junit4] Completed [137/422] on J0 in 0.69s, 2 tests
    [smoker] [junit4]
    [smoker] [junit4] Suite: org.apache.lucene.codecs.compressing.TestHighCompressionMode
    [smoker] [junit4] Completed [138/422] on J0 in 1.58s, 7 tests
    [smoker] [junit4]
    [smoker] [junit4] Suite: org.apache.lucene.index.TestPersistentSnapshotDeletionPolicy
    [smoker] [junit4] Completed [139/422] on J0 in 2.07s, 13 tests
    [smoker] [junit4]
    [smoker] [junit4] Suite: org.apache.lucene.search.TestLRUFilterCache
    [smoker] [junit4] Completed [140/422] on J0 in 9.00s, 10 tests
    [smoker] [junit4]
    [smoker] [junit4] Suite: org.apache.lucene.search.TestLRUQueryCache
    [smoker] [junit4] Completed [141/422] on J1 in 17.08s, 17 tests
    [smoker] [junit4]
    [smoker] [junit4] Suite: org.apache.lucene.index.TestIndexInput
    [smoker] [junit4] Completed [142/422] on J1 in 3.00s, 2 tests
    [smoker] [junit4]
    [smoker] [junit4] Suite: org.apache.lucene.util.TestNotDocIdSet
    [smoker] [junit4] Completed [143/422] on J1 in 2.83s, 6 tests
    [smoker] [junit4]
    [smoker] [junit4] Suite: org.apache.lucene.search.TestFieldCacheRewriteMethod
    [smoker] [junit4] Completed [144/422] on J1 in 4.27s, 2 tests
    [smoker] [junit4]
    [smoker] [junit4] Suite: org.apache.lucene.index.TestNoMergePolicy
    [smoker] [junit4] Completed [145/422] on J1 in 0.26s, 4 tests
    [smoker] [junit4]
    [smoker] [junit4] Suite: org.apache.lucene.index.Test2BSortedDocValuesOrds
    [smoker] [junit4] IGNOR/A 0.00s J1 | Test2BSortedDocValuesOrds.test2BOrds
    [smoker] [junit4] > Assumption #1: 'monster' test group is disabled (@Monster(value=Takes ~ 6 hours if the heap is 5gb))
    [smoker] [junit4] Completed [146/422] on J1 in 0.01s, 1 test, 1 skipped
    [smoker] [junit4]
    [smoker] [junit4] Suite: org.apache.lucene.TestAssertions
    [smoker] [junit4] Completed [147/422] on J1 in 0.06s, 1 test
    [smoker] [junit4]
    [smoker] [junit4] Suite: org.apache.lucene.search.TestSimpleExplanationsWithFillerDocs
    [smoker] [junit4] Completed [148/422] on J2 in 41.92s, 73 tests
    [smoker] [junit4]
    [smoker] [junit4] Suite: org.apache.lucene.index.TestTermsEnum
    [smoker] [junit4] IGNOR/A 0.00s J0 | TestTermsEnum.testVaryingTermsPerSegment
    [smoker] [junit4] > Assumption #1: 'slow' test group is disabled (@Slow())
    [smoker] [junit4] Completed [149/422] on J0 in 16.08s, 11 tests, 1 skipped
    [smoker] [junit4]
    [smoker] [junit4] Suite: org.apache.lucene.util.TestPagedBytes
    [smoker] [junit4] Completed [150/422] on J2 in 4.92s, 4 tests, 1 skipped
    [smoker] [junit4]
    [smoker] [junit4] Suite: org.apache.lucene.util.TestArrayUtil
    [smoker] [junit4] Completed [151/422] on J0 in 3.14s, 13 tests
    [smoker] [junit4]
    [smoker] [junit4] Suite: org.apache.lucene.util.TestIOUtils
    [smoker] [junit4] Completed [152/422] on J0 in 0.13s, 18 tests
    [smoker] [junit4]
    [smoker] [junit4] Suite: org.apache.lucene.index.TestAtomicUpdate
    [smoker] [junit4] Completed [153/422] on J2 in 4.48s, 1 test
    [smoker] [junit4]
    [smoker] [junit4] Suite: org.apache.lucene.index.TestParallelLeafReader
    [smoker] [junit4] Completed [154/422] on J2 in 0.18s, 7 tests
    [smoker] [junit4]
    [smoker] [junit4] Suite: org.apache.lucene.store.TestSleepingLockWrapper
    [smoker] [junit4] Completed [155/422] on J1 in 12.17s, 6 tests
    [smoker] [junit4]
    [smoker] [junit4] Suite: org.apache.lucene.search.TestTermRangeQuery
    [smoker] [junit4] Completed [156/422] on J1 in 0.25s, 7 tests
    [smoker] [junit4]
    [smoker] [junit4] Suite: org.apache.lucene.index.TestReadOnlyIndex
    [smoker] [junit4] Completed [157/422] on J1 in 0.07s, 1 test
    [smoker] [junit4]
    [smoker] [junit4] Suite: org.apache.lucene.search.TestSameScoresWithThreads
    [smoker] [junit4] Completed [158/422] on J1 in 1.52s, 1 test
    [smoker] [junit4]
    [smoker] [junit4] Suite: org.apache.lucene.index.TestUpgradeIndexMergePolicy
    [smoker] [junit4] Completed [159/422] on J1 in 0.08s, 1 test
    [smoker] [junit4]
    [smoker] [junit4] Suite: org.apache.lucene.util.TestNamedSPILoader
    [smoker] [junit4] Completed [160/422] on J1 in 0.04s, 3 tests
    [smoker] [junit4]
    [smoker] [junit4] Suite: org.apache.lucene.search.TestPrefixRandom
    [smoker] [junit4] Completed [161/422] on J1 in 1.19s, 1 test
    [smoker] [junit4]
    [smoker] [junit4] Suite: org.apache.lucene.index.TestIndexWriter
    [smoker] [junit4] Completed [162/422] on J0 in 9.60s, 70 tests
    [smoker] [junit4]
    [smoker] [junit4] Suite: org.apache.lucene.index.TestMixedDocValuesUpdates
    [smoker] [junit4] IGNOR/A 0.00s J2 | TestMixedDocValuesUpdates.testTonsOfUpdates
    [smoker] [junit4] > Assumption #1: 'nightly' test group is disabled (@Nightly())
    [smoker] [junit4] Completed [163/422] on J2 in 7.72s, 4 tests, 1 skipped
    [smoker] [junit4]
    [smoker] [junit4] Suite: org.apache.lucene.search.TestQueryCachingPolicy
    [smoker] [junit4] Completed [164/422] on J2 in 0.10s, 1 test
    [smoker] [junit4]
    [smoker] [junit4] Suite: org.apache.lucene.util.automaton.TestDeterminism
    [smoker] [junit4] Completed [165/422] on J2 in 0.79s, 2 tests
    [smoker] [junit4]
    [smoker] [junit4] Suite: org.apache.lucene.store.TestSimpleFSLockFactory
    [smoker] [junit4] IGNOR/A 0.00s J2 | TestSimpleFSLockFactory.testDeleteLockFile
    [smoker] [junit4] > Assumption #1: test requires the ability to delete a locked file(throwable: java.io.IOException: cannot delete file: test.lock, a virus scanner has it open)
    [smoker] [junit4] Completed [166/422] on J2 in 10.04s, 7 tests, 1 skipped
    [smoker] [junit4]
    [smoker] [junit4] Suite: org.apache.lucene.index.TestMultiDocValues
    [smoker] [junit4] Completed [167/422] on J2 in 0.88s, 8 tests
    [smoker] [junit4]
    [smoker] [junit4] Suite: org.apache.lucene.codecs.lucene50.TestBlockPostingsFormat
    [smoker] [junit4] IGNOR/A 0.00s J2 | TestBlockPostingsFormat.testRamBytesUsed
    [smoker] [junit4] > Assumption #1: 'slow' test group is disabled (@Slow())
    [smoker] [junit4] Completed [168/422] on J2 in 10.05s, 32 tests, 1 skipped
    [smoker] [junit4]
    [smoker] [junit4] Suite: org.apache.lucene.search.TestDocIdSet
    [smoker] [junit4] Completed [169/422] on J2 in 0.07s, 3 tests
    [smoker] [junit4]
    [smoker] [junit4] Suite: org.apache.lucene.search.TestPhraseQuery
    [smoker] [junit4] Completed [170/422] on J2 in 1.84s, 23 tests
    [smoker] [junit4]
    [smoker] [junit4] Suite: org.apache.lucene.index.TestReaderWrapperDVTypeCheck
    [smoker] [junit4] Completed [171/422] on J2 in 0.03s, 1 test
    [smoker] [junit4]
    [smoker] [junit4] Suite: org.apache.lucene.search.TestTopFieldCollector
    [smoker] [junit4] Completed [172/422] on J2 in 0.28s, 7 tests
    [smoker] [junit4]
    [smoker] [junit4] Suite: org.apache.lucene.search.TestWildcardRandom
    [smoker] [junit4] Completed [173/422] on J2 in 0.57s, 1 test
    [smoker] [junit4]
    [smoker] [junit4] Suite: org.apache.lucene.search.spans.TestSpanExplanations
    [smoker] [junit4] Completed [174/422] on J2 in 1.40s, 30 tests
    [smoker] [junit4]
    [smoker] [junit4] Suite: org.apache.lucene.search.TestScoreCachingWrappingScorer
    [smoker] [junit4] Completed [175/422] on J2 in 0.01s, 1 test
    [smoker] [junit4]
    [smoker] [junit4] Suite: org.apache.lucene.index.TestDocInverterPerFieldErrorInfo
    [smoker] [junit4] Completed [176/422] on J2 in 0.03s, 2 tests
    [smoker] [junit4]
    [smoker] [junit4] Suite: org.apache.lucene.util.TestSPIClassIterator
    [smoker] [junit4] Completed [177/422] on J2 in 0.04s, 1 test
    [smoker] [junit4]
    [smoker] [junit4] Suite: org.apache.lucene.analysis.TestCharFilter
    [smoker] [junit4] Completed [178/422] on J2 in 0.08s, 4 tests
    [smoker] [junit4]
    [smoker] [junit4] Suite: org.apache.lucene.search.TestSearchWithThreads
    [smoker] [junit4] Completed [179/422] on J2 in 6.15s, 1 test
    [smoker] [junit4]
    [smoker] [junit4] Suite: org.apache.lucene.codecs.lucene54.TestLucene54DocValuesFormat
    [smoker] [junit4] IGNOR/A 0.00s J1 | TestLucene54DocValuesFormat.testTermsEnumRandomMany
    [smoker] [junit4] > Assumption #1: 'nightly' test group is disabled (@Nightly())
    [smoker] [junit4] IGNOR/A 0.00s J1 | TestLucene54DocValuesFormat.testThreads3
    [smoker] [junit4] > Assumption #1: 'slow' test group is disabled (@Slow())
    [smoker] [junit4] IGNOR/A 0.00s J1 | TestLucene54DocValuesFormat.testRamBytesUsed
    [smoker] [junit4] > Assumption #1: 'slow' test group is disabled (@Slow())
    [smoker] [junit4] IGNOR/A 0.00s J1 | TestLucene54DocValuesFormat.testTermsEnumFixedWidth
    [smoker] [junit4] > Assumption #1: 'slow' test group is disabled (@Slow())
    [smoker] [junit4] IGNOR/A 0.00s J1 | TestLucene54DocValuesFormat.testSortedSetAroundBlockSize
    [smoker] [junit4] > Assumption #1: 'slow' test group is disabled (@Slow())
    [smoker] [junit4] IGNOR/A 0.00s J1 | TestLucene54DocValuesFormat.testSortedSetVariableLengthManyVsStoredFields
    [smoker] [junit4] > Assumption #1: 'nightly' test group is disabled (@Nightly())
    [smoker] [junit4] IGNOR/A 0.00s J1 | TestLucene54DocValuesFormat.testSortedNumericAroundBlockSize
    [smoker] [junit4] > Assumption #1: 'slow' test group is disabled (@Slow())
    [smoker] [junit4] IGNOR/A 0.00s J1 | TestLucene54DocValuesFormat.testSortedVariableLengthManyVsStoredFields
    [smoker] [junit4] > Assumption #1: 'nightly' test group is disabled (@Nightly())
    [smoker] [junit4] IGNOR/A 0.00s J1 | TestLucene54DocValuesFormat.testSortedVariableLengthBigVsStoredFields
    [smoker] [junit4] > Assumption #1: 'slow' test group is disabled (@Slow())
    [smoker] [junit4] IGNOR/A 0.00s J1 | TestLucene54DocValuesFormat.testSortedSetVariableLengthBigVsStoredFields
    [smoker] [junit4] > Assumption #1: 'slow' test group is disabled (@Slow())
    [smoker] [junit4] IGNOR/A 0.00s J1 | TestLucene54DocValuesFormat.testThreads2
    [smoker] [junit4] > Assumption #1: 'slow' test group is disabled (@Slow())
    [smoker] [junit4] IGNOR/A 0.00s J1 | TestLucene54DocValuesFormat.testSparseDocValuesVsStoredFields
    [smoker] [junit4] > Assumption #1: 'slow' test group is disabled (@Slow())
    [smoker] [junit4] IGNOR/A 0.00s J1 | TestLucene54DocValuesFormat.testTermsEnumVariableWidth
    [smoker] [junit4] > Assumption #1: 'slow' test group is disabled (@Slow())
    [smoker] [junit4] Completed [180/422] on J1 in 36.42s, 109 tests, 13 skipped
    [smoker] [junit4]
    [smoker] [junit4] Suite: org.apache.lucene.search.spans.TestSpansAdvanced2
    [smoker] [junit4] Completed [181/422] on J1 in 0.40s, 4 tests
    [smoker] [junit4]
    [smoker] [junit4] Suite: org.apache.lucene.util.TestFixedBitDocIdSet
    [smoker] [junit4] Completed [182/422] on J1 in 2.21s, 5 tests
    [smoker] [junit4]
    [smoker] [junit4] Suite: org.apache.lucene.util.fst.TestFSTs
    [smoker] [junit4] IGNOR/A 0.00s J1 | TestFSTs.testShortestPathsWFSTRandom
    [smoker] [junit4] > Assumption #1: 'slow' test group is disabled (@Slow())
    [smoker] [junit4] IGNOR/A 0.00s J1 | TestFSTs.testExpandedCloseToRoot
    [smoker] [junit4] > Assumption #1: 'slow' test group is disabled (@Slow())
    [smoker] [junit4] IGNOR/A 0.00s J1 | TestFSTs.testShortestPathsRandom
    [smoker] [junit4] > Assumption #1: 'slow' test group is disabled (@Slow())
    [smoker] [junit4] IGNOR/A 0.00s J1 | TestFSTs.testRejectNoLimits
    [smoker] [junit4] > Assumption #1: 'slow' test group is disabled (@Slow())
    [smoker] [junit4] IGNOR/A 0.00s J1 | TestFSTs.testFinalOutputOnEndState
    [smoker] [junit4] > Assumption #1: 'slow' test group is disabled (@Slow())
    [smoker] [junit4] IGNOR/A 0.00s J1 | TestFSTs.testPrimaryKeys
    [smoker] [junit4] > Assumption #1: 'slow' test group is disabled (@Slow())
    [smoker] [junit4] IGNOR/A 0.00s J1 | TestFSTs.testSingleString
    [smoker] [junit4] > Assumption #1: 'slow' test group is disabled (@Slow())
    [smoker] [junit4] IGNOR/A 0.00s J1 | TestFSTs.testDuplicateFSAString
    [smoker] [junit4] > Assumption #1: 'slow' test group is disabled (@Slow())
    [smoker] [junit4] IGNOR/A 0.00s J1 | TestFSTs.testRandomTermLookup
    [smoker] [junit4] > Assumption #1: 'slow' test group is disabled (@Slow())
    [smoker] [junit4] IGNOR/A 0.00s J1 | TestFSTs.testShortestPathsWFST
    [smoker] [junit4] > Assumption #1: 'slow' test group is disabled (@Slow())
    [smoker] [junit4] IGNOR/A 0.00s J1 | TestFSTs.testBasicFSA
    [smoker] [junit4] > Assumption #1: 'slow' test group is disabled (@Slow())
    [smoker] [junit4] IGNOR/A 0.00s J1 | TestFSTs.testRandomWords
    [smoker] [junit4] > Assumption #1: 'slow' test group is disabled (@Slow())
    [smoker] [junit4] IGNOR/A 0.00s J1 | TestFSTs.testBigSet
    [smoker] [junit4] > Assumption #1: 'nightly' test group is disabled (@Nightly())
    [smoker] [junit4] IGNOR/A 0.00s J1 | TestFSTs.testLargeOutputsOnArrayArcs
    [smoker] [junit4] > Assumption #1: 'slow' test group is disabled (@Slow())
    [smoker] [junit4] IGNOR/A 0.00s J1 | TestFSTs.testNonFinalStopNode
    [smoker] [junit4] > Assumption #1: 'slow' test group is disabled (@Slow())
    [smoker] [junit4] IGNOR/A 0.00s J1 | TestFSTs.testIllegallyModifyRootArc
    [smoker] [junit4] > Assumption #1: 'slow' test group is disabled (@Slow())
    [smoker] [junit4] IGNOR/A 0.00s J1 | TestFSTs.testShortestPaths
    [smoker] [junit4] > Assumption #1: 'slow' test group is disabled (@Slow())
    [smoker] [junit4] IGNOR/A 0.00s J1 | TestFSTs.testSimple
    [smoker] [junit4] > Assumption #1: 'slow' test group is disabled (@Slow())
    [smoker] [junit4] IGNOR/A 0.00s J1 | TestFSTs.testRealTerms
    [smoker] [junit4] > Assumption #1: 'slow' test group is disabled (@Slow())
    [smoker] [junit4] IGNOR/A 0.00s J1 | TestFSTs.testInternalFinalState
    [smoker] [junit4] > Assumption #1: 'slow' test group is disabled (@Slow())
    [smoker] [junit4] Completed [183/422] on J1 in 0.19s, 20 tests, 20 skipped
    [smoker] [junit4]
    [smoker] [junit4] Suite: org.apache.lucene.search.TestLiveFieldValues
    [smoker] [junit4] Completed [184/422] on J2 in 3.80s, 1 test
    [smoker] [junit4]
    [smoker] [junit4] Suite: org.apache.lucene.search.TestRegexpRandom
    [smoker] [junit4] Completed [185/422] on J2 in 0.38s, 1 test
    [smoker] [junit4]
    [smoker] [junit4] Suite: org.apache.lucene.search.spans.TestSpanBoostQuery
    [smoker] [junit4] Completed [186/422] on J2 in 0.05s, 2 tests
    [smoker] [junit4]
    [smoker] [junit4] Suite: org.apache.lucene.index.TestThreadedForceMerge
    [smoker] [junit4] Completed [187/422] on J2 in 1.85s, 1 test
    [smoker] [junit4]
    [smoker] [junit4] Suite: org.apache.lucene.analysis.tokenattributes.TestPackedTokenAttributeImpl
    [smoker] [junit4] Completed [188/422] on J2 in 0.07s, 4 tests
    [smoker] [junit4]
    [smoker] [junit4] Suite: org.apache.lucene.index.TestStressAdvance
    [smoker] [junit4] Completed [189/422] on J1 in 6.08s, 1 test
    [smoker] [junit4]
    [smoker] [junit4] Suite: org.apache.lucene.util.TestPriorityQueue
    [smoker] [junit4] Completed [190/422] on J1 in 0.40s, 7 tests
    [smoker] [junit4]
    [smoker] [junit4] Suite: org.apache.lucene.index.TestFieldReuse
    [smoker] [junit4] Completed [191/422] on J1 in 0.09s, 3 tests
    [smoker] [junit4]
    [smoker] [junit4] Suite: org.apache.lucene.codecs.perfield.TestPerFieldDocValuesFormat
    [smoker] [junit4] IGNOR/A 0.00s J0 | TestPerFieldDocValuesFormat.testThreads2
    [smoker] [junit4] > Assumption #1: 'slow' test group is disabled (@Slow())
    [smoker] [junit4] IGNOR/A 0.00s J0 | TestPerFieldDocValuesFormat.testThreads3
    [smoker] [junit4] > Assumption #1: 'slow' test group is disabled (@Slow())
    [smoker] [junit4] IGNOR/A 0.00s J0 | TestPerFieldDocValuesFormat.testRamBytesUsed
    [smoker] [junit4] > Assumption #1: 'slow' test group is disabled (@Slow())
    [smoker] [junit4] Completed [192/422] on J0 in 46.19s, 96 tests, 3 skipped
    [smoker] [junit4]
    [smoker] [junit4] Suite: org.apache.lucene.codecs.perfield.TestPerFieldPostingsFormat
    [smoker] [junit4] IGNOR/A 0.00s J2 | TestPerFieldPostingsFormat.testRamBytesUsed
    [smoker] [junit4] > Assumption #1: 'slow' test group is disabled (@Slow())
    [smoker] [junit4] IGNOR/A 0.00s J2 | TestPerFieldPostingsFormat.testPostingsEnumReuse
    [smoker] [junit4] > Assumption #1: The MockRandom PF randomizes content on the fly, so we can't check it
    [smoker] [junit4] IGNOR/A 0.00s J2 | TestPerFieldPostingsFormat.testMergeStability
    [smoker] [junit4] > Assumption #1: The MockRandom PF randomizes content on the fly, so we can't check it
    [smoker] [junit4] Completed [193/422] on J2 in 11.68s, 30 tests, 3 skipped
    [smoker] [junit4]
    [smoker] [junit4] Suite: org.apache.lucene.index.TestDocumentWriter
    [smoker] [junit4] Completed [194/422] on J2 in 0.42s, 6 tests
    [smoker] [junit4]
    [smoker] [junit4] Suite: org.apache.lucene.search.TestIndexSearcher
    [smoker] [junit4] Completed [195/422] on J2 in 0.60s, 5 tests
    [smoker] [junit4]
    [smoker] [junit4] Suite: org.apache.lucene.TestSearchForDuplicates
    [smoker] [junit4] Completed [196/422] on J2 in 0.43s, 1 test
    [smoker] [junit4]
    [smoker] [junit4] Suite: org.apache.lucene.document.TestField
    [smoker] [junit4] Completed [197/422] on J2 in 0.14s, 19 tests
    [smoker] [junit4]
    [smoker] [junit4] Suite: org.apache.lucene.search.TestNumericRangeQuery64
    [smoker] [junit4] Completed [198/422] on J0 in 12.45s, 29 tests
    [smoker] [junit4]
    [smoker] [junit4] Suite: org.apache.lucene.index.TestNumericDocValuesUpdates
    [smoker] [junit4] IGNOR/A 0.00s J2 | TestNumericDocValuesUpdates.testTonsOfUpdates
    [smoker] [junit4] > Assumption #1: 'nightly' test group is disabled (@Nightly())
    [smoker] [junit4] Completed [199/422] on J2 in 8.08s, 31 tests, 1 skipped
    [smoker] [junit4]
    [smoker] [junit4] Suite: org.apache.lucene.index.TestIndexWriterConfig
    [smoker] [junit4] Completed [200/422] on J2 in 0.11s, 8 tests
    [smoker] [junit4]
    [smoker] [junit4] Suite: org.apache.lucene.util.fst.TestBytesStore
    [smoker] [junit4] Completed [201/422] on J0 in 2.36s, 1 test
    [smoker] [junit4]
    [smoker] [junit4] Suite: org.apache.lucene.search.TestQueryWrapperFilter
    [smoker] [junit4] Completed [202/422] on J2 in 1.22s, 6 tests
    [smoker] [junit4]
    [smoker] [junit4] Suite: org.apache.lucene.util.TestCloseableThreadLocal
    [smoker] [junit4] Completed [203/422] on J2 in 0.03s, 3 tests
    [smoker] [junit4]
    [smoker] [junit4] Suite: org.apache.lucene.index.TestIndexWriterWithThreads
    [smoker] [junit4] IGNOR/A 0.00s J2 | TestIndexWriterWithThreads.testIOExceptionDuringWriteSegmentWithThreads
    [smoker] [junit4] > Assumption #1: 'slow' test group is disabled (@Slow())
    [smoker] [junit4] IGNOR/A 0.00s J2 | TestIndexWriterWithThreads.testCloseWithThreads
    [smoker] [junit4] > Assumption #1: 'slow' test group is disabled (@Slow())
    [smoker] [junit4] IGNOR/A 0.00s J2 | TestIndexWriterWithThreads.testRollbackAndCommitWithThreads
    [smoker] [junit4] > Assumption #1: 'slow' test group is disabled (@Slow())
    [smoker] [junit4] IGNOR/A 0.00s J2 | TestIndexWriterWithThreads.testIOExceptionDuringWriteSegment
    [smoker] [junit4] > Assumption #1: 'slow' test group is disabled (@Slow())
    [smoker] [junit4] IGNOR/A 0.00s J2 | TestIndexWriterWithThreads.testImmediateDiskFullWithThreads
    [smoker] [junit4] > Assumption #1: 'slow' test group is disabled (@Slow())
    [smoker] [junit4] IGNOR/A 0.00s J2 | TestIndexWriterWithThreads.testOpenTwoIndexWritersOnDifferentThreads
    [smoker] [junit4] > Assumption #1: 'slow' test group is disabled (@Slow())
    [smoker] [junit4] IGNOR/A 0.00s J2 | TestIndexWriterWithThreads.testIOExceptionDuringWriteSegmentWithThreadsOnlyOnce
    [smoker] [junit4] > Assumption #1: 'slow' test group is disabled (@Slow())
    [smoker] [junit4] IGNOR/A 0.00s J2 | TestIndexWriterWithThreads.testIOExceptionDuringAbortOnlyOnce
    [smoker] [junit4] > Assumption #1: 'slow' test group is disabled (@Slow())
    [smoker] [junit4] IGNOR/A 0.01s J2 | TestIndexWriterWithThreads.testIOExceptionDuringAbortWithThreads
    [smoker] [junit4] > Assumption #1: 'slow' test group is disabled (@Slow())
    [smoker] [junit4] IGNOR/A 0.00s J2 | TestIndexWriterWithThreads.testIOExceptionDuringAbortWithThreadsOnlyOnce
    [smoker] [junit4] > Assumption #1: 'slow' test group is disabled (@Slow())
    [smoker] [junit4] IGNOR/A 0.00s J2 | TestIndexWriterWithThreads.testIOExceptionDuringAbort
    [smoker] [junit4] > Assumption #1: 'slow' test group is disabled (@Slow())
    [smoker] [junit4] IGNOR/A 0.00s J2 | TestIndexWriterWithThreads.testIOExceptionDuringWriteSegmentOnlyOnce
    [smoker] [junit4] > Assumption #1: 'slow' test group is disabled (@Slow())
    [smoker] [junit4] Completed [204/422] on J2 in 0.02s, 12 tests, 12 skipped
    [smoker] [junit4]
    [smoker] [junit4] Suite: org.apache.lucene.search.TestNumericRangeQuery32
    [smoker] [junit4] Completed [205/422] on J2 in 13.26s, 23 tests
    [smoker] [junit4]
    [smoker] [junit4] Suite: org.apache.lucene.util.packed.TestPackedInts
    [smoker] [junit4] IGNOR/A 0.00s J0 | TestPackedInts.testBlockReaderOverflow
    [smoker] [junit4] > Assumption #1: 'nightly' test group is disabled (@Nightly())
    [smoker] [junit4] Completed [206/422] on J0 in 14.61s, 28 tests, 3 skipped
    [smoker] [junit4]
    [smoker] [junit4] Suite: org.apache.lucene.store.TestMultiMMap
    [smoker] [junit4] Completed [207/422] on J0 in 2.80s, 54 tests
    [smoker] [junit4]
    [smoker] [junit4] Suite: org.apache.lucene.index.TestDeletionPolicy
    [smoker] [junit4] Completed [208/422] on J0 in 3.95s, 6 tests
    [smoker] [junit4]
    [smoker] [junit4] Suite: org.apache.lucene.search.TestBooleanOr
    [smoker] [junit4] Completed [209/422] on J0 in 2.23s, 7 tests
    [smoker] [junit4]
    [smoker] [junit4] Suite: org.apache.lucene.search.TestShardSearching
    [smoker] [junit4] Completed [210/422] on J2 in 10.22s, 1 test
    [smoker] [junit4]
    [smoker] [junit4] Suite: org.apache.lucene.search.TestSloppyPhraseQuery
    [smoker] [junit4] Completed [211/422] on J0 in 1.76s, 9 tests
    [smoker] [junit4]
    [smoker] [junit4] Suite: org.apache.lucene.index.TestIndexWriterDelete
    [smoker] [junit4] IGNOR/A 0.00s J2 | TestIndexWriterDelete.testApplyDeletesOnFlush
    [smoker] [junit4] > Assumption #1: 'nightly' test group is disabled (@Nightly())
    [smoker] [junit4] Completed [212/422] on J2 in 6.60s, 27 tests, 1 skipped
    [smoker] [junit4]
    [smoker] [junit4] Suite: org.apache.lucene.index.TestDuelingCodecs
    [smoker] [junit4] IGNOR/A 0.00s J2 | TestDuelingCodecs.testCrazyReaderEquals
    [smoker] [junit4] > Assumption #1: 'slow' test group is disabled (@Slow())
    [smoker] [junit4] IGNOR/A 0.00s J2 | TestDuelingCodecs.testEquals
    [smoker] [junit4] > Assumption #1: 'slow' test group is disabled (@Slow())
    [smoker] [junit4] Completed [213/422] on J2 in 0.02s, 2 tests, 2 skipped
    [smoker] [junit4]
    [smoker] [junit4] Suite: org.apache.lucene.index.TestNorms
    [smoker] [junit4] IGNOR/A 0.00s J2 | TestNorms.testCustomEncoder
    [smoker] [junit4] > Assumption #1: 'slow' test group is disabled (@Slow())
    [smoker] [junit4] IGNOR/A 0.00s J2 | TestNorms.testMaxByteNorms
    [smoker] [junit4] > Assumption #1: 'slow' test group is disabled (@Slow())
    [smoker] [junit4] Completed [214/422] on J2 in 0.03s, 2 tests, 2 skipped
    [smoker] [junit4]
    [smoker] [junit4] Suite: org.apache.lucene.index.TestNRTThreads
    [smoker] [junit4] Completed [215/422] on J0 in 7.50s, 1 test
    [smoker] [junit4]
    [smoker] [junit4] Suite: org.apache.lucene.index.TestIndexWriterCommit
    [smoker] [junit4] Completed [216/422] on J2 in 2.68s, 13 tests
    [smoker] [junit4]
    [smoker] [junit4] Suite: org.apache.lucene.index.TestConcurrentMergeScheduler
    [smoker] [junit4] Completed [217/422] on J0 in 3.70s, 16 tests
    [smoker] [junit4]
    [smoker] [junit4] Suite: org.apache.lucene.search.TestBoolean2
    [smoker] [junit4] 2> NOTE: reproduce with: ant test -Dtestcase=TestBoolean2 -Dtests.method=testQueries08 -Dtests.seed=3CAB6CBA18152C51 -Dtests.multiplier=2 -Dtests.locale=zh-TW -Dtests.timezone=Asia/Taipei -Dtests.asserts=true -Dtests.file.encoding=ISO-8859-1
    [smoker] [junit4] FAILURE 0.01s J1 | TestBoolean2.testQueries08 <<<
    [smoker] [junit4] > Throwable #1: junit.framework.AssertionFailedError: hits1 doc nrs for hit 0 expected:<4952> but was:<7001>
    [smoker] [junit4] > at __randomizedtesting.SeedInfo.seed([3CAB6CBA18152C51:4F972F8FFAE578]:0)
    [smoker] [junit4] > at junit.framework.Assert.fail(Assert.java:50)
    [smoker] [junit4] > at junit.framework.Assert.failNotEquals(Assert.java:287)
    [smoker] [junit4] > at junit.framework.Assert.assertEquals(Assert.java:67)
    [smoker] [junit4] > at junit.framework.Assert.assertEquals(Assert.java:199)
    [smoker] [junit4] > at org.apache.lucene.search.CheckHits.checkDocIds(CheckHits.java:190)
    [smoker] [junit4] > at org.apache.lucene.search.CheckHits.checkHitsQuery(CheckHits.java:203)
    [smoker] [junit4] > at org.apache.lucene.search.TestBoolean2.queriesTest(TestBoolean2.java:192)
    [smoker] [junit4] > at org.apache.lucene.search.TestBoolean2.testQueries08(TestBoolean2.java:299)
    [smoker] [junit4] > at java.lang.Thread.run(Thread.java:745)
    [smoker] [junit4] 2> NOTE: reproduce with: ant test -Dtestcase=TestBoolean2 -Dtests.method=testQueries03 -Dtests.seed=3CAB6CBA18152C51 -Dtests.multiplier=2 -Dtests.locale=zh-TW -Dtests.timezone=Asia/Taipei -Dtests.asserts=true -Dtests.file.encoding=ISO-8859-1
    [smoker] [junit4] FAILURE 0.02s J1 | TestBoolean2.testQueries03 <<<
    [smoker] [junit4] > Throwable #1: junit.framework.AssertionFailedError: hits1 doc nrs for hit 0 expected:<4952> but was:<7001>
    [smoker] [junit4] > at __randomizedtesting.SeedInfo.seed([3CAB6CBA18152C51:794ED28CF8C36DD1]:0)
    [smoker] [junit4] > at junit.framework.Assert.fail(Assert.java:50)
    [smoker] [junit4] > at junit.framework.Assert.failNotEquals(Assert.java:287)
    [smoker] [junit4] > at junit.framework.Assert.assertEquals(Assert.java:67)
    [smoker] [junit4] > at junit.framework.Assert.assertEquals(Assert.java:199)
    [smoker] [junit4] > at org.apache.lucene.search.CheckHits.checkDocIds(CheckHits.java:190)
    [smoker] [junit4] > at org.apache.lucene.search.CheckHits.checkHitsQuery(CheckHits.java:203)
    [smoker] [junit4] > at org.apache.lucene.search.TestBoolean2.queriesTest(TestBoolean2.java:192)
    [smoker] [junit4] > at org.apache.lucene.search.TestBoolean2.testQueries03(TestBoolean2.java:246)
    [smoker] [junit4] > at java.lang.Thread.run(Thread.java:745)
    [smoker] [junit4] 2> NOTE: reproduce with: ant test -Dtestcase=TestBoolean2 -Dtests.method=testQueries02 -Dtests.seed=3CAB6CBA18152C51 -Dtests.multiplier=2 -Dtests.locale=zh-TW -Dtests.timezone=Asia/Taipei -Dtests.asserts=true -Dtests.file.encoding=ISO-8859-1
    [smoker] [junit4] FAILURE 0.00s J1 | TestBoolean2.testQueries02 <<<
    [smoker] [junit4] > Throwable #1: junit.framework.AssertionFailedError: hits1 doc nrs for hit 0 expected:<4952> but was:<7001>
    [smoker] [junit4] > at __randomizedtesting.SeedInfo.seed([3CAB6CBA18152C51:4FAA6FF5D32908CE]:0)
    [smoker] [junit4] > at junit.framework.Assert.fail(Assert.java:50)
    [smoker] [junit4] > at junit.framework.Assert.failNotEquals(Assert.java:287)
    [smoker] [junit4] > at junit.framework.Assert.assertEquals(Assert.java:67)
    [smoker] [junit4] > at junit.framework.Assert.assertEquals(Assert.java:199)
    [smoker] [junit4] > at org.apache.lucene.search.CheckHits.checkDocIds(CheckHits.java:190)
    [smoker] [junit4] > at org.apache.lucene.search.CheckHits.checkHitsQuery(CheckHits.java:203)
    [smoker] [junit4] > at org.apache.lucene.search.TestBoolean2.queriesTest(TestBoolean2.java:192)
    [smoker] [junit4] > at org.apache.lucene.search.TestBoolean2.testQueries02(TestBoolean2.java:236)
    [smoker] [junit4] > at java.lang.Thread.run(Thread.java:745)
    [smoker] [junit4] 2> NOTE: reproduce with: ant test -Dtestcase=TestBoolean2 -Dtests.method=testQueries01 -Dtests.seed=3CAB6CBA18152C51 -Dtests.multiplier=2 -Dtests.locale=zh-TW -Dtests.timezone=Asia/Taipei -Dtests.asserts=true -Dtests.file.encoding=ISO-8859-1
    [smoker] [junit4] FAILURE 0.00s J1 | TestBoolean2.testQueries01 <<<
    [smoker] [junit4] > Throwable #1: junit.framework.AssertionFailedError: hits1 doc nrs for hit 0 expected:<4952> but was:<7001>
    [smoker] [junit4] > at __randomizedtesting.SeedInfo.seed([3CAB6CBA18152C51:21F52AC98D69C7B9]:0)
    [smoker] [junit4] > at junit.framework.Assert.fail(Assert.java:50)
    [smoker] [junit4] > at junit.framework.Assert.failNotEquals(Assert.java:287)
    [smoker] [junit4] > at junit.framework.Assert.assertEquals(Assert.java:67)
    [smoker] [junit4] > at junit.framework.Assert.assertEquals(Assert.java:199)
    [smoker] [junit4] > at org.apache.lucene.search.CheckHits.checkDocIds(CheckHits.java:190)
    [smoker] [junit4] > at org.apache.lucene.search.CheckHits.checkHitsQuery(CheckHits.java:203)
    [smoker] [junit4] > at org.apache.lucene.search.TestBoolean2.queriesTest(TestBoolean2.java:192)
    [smoker] [junit4] > at org.apache.lucene.search.TestBoolean2.testQueries01(TestBoolean2.java:226)
    [smoker] [junit4] > at java.lang.Thread.run(Thread.java:745)
    [smoker] [junit4] 2> NOTE: test params are: codec=Asserting(Lucene54): {field2=PostingsFormat(name=Asserting), field=PostingsFormat(name=Asserting)}, docValues:{}, sim=RandomSimilarity(queryNorm=true,coord=no): {field2=DFR I(F)Z(0.3), field=DFR I(ne)B2}, locale=zh-TW, timezone=Asia/Taipei
    [smoker] [junit4] 2> NOTE: Linux 3.13.0-85-generic amd64/Oracle Corporation 1.7.0_80 (64-bit)/cpus=4,threads=1,free=227058416,total=309854208
    [smoker] [junit4] 2> NOTE: All tests run in this JVM: [TestStressIndexing2, TestDirectoryReaderReopen, TestFieldMaskingSpanQuery, TestFlushByRamOrCountsPolicy, TestMultiCollector, TestPrefixQuery, TestNewestSegment, TestUsageTrackingFilterCachingPolicy, TestTerms, TestFieldsReader, TestLazyProxSkipping, TestSetOnce, TestDocValuesIndexing, TestIndexWriterExceptions, TestScorerPerf, TestWeakIdentityMap, TestSpanMultiTermQueryWrapper, TestBooleanMinShouldMatch, TestNeedsScores, TestBasics, TestLockFactory, TestBytesRefAttImpl, TestTermVectorsReader, TestTermsEnum2, TestDuelingCodecsAtNight, TestDisjunctionMaxQuery, TestFlex, TestSparseFixedBitDocIdSet, TestSmallFloat, TestReaderClosed, TestCodecs, TestIndexWriterOnDiskFull, TestIndexWriterThreadsToSegments, TestManyFields, TestBlockPostingsFormat3, TestRollback, TestLRUQueryCache, TestIndexInput, TestNotDocIdSet, TestFieldCacheRewriteMethod, TestNoMergePolicy, Test2BSortedDocValuesOrds, TestAssertions, TestSleepingLockWrapper, TestTermRangeQuery, TestReadOnlyIndex, TestSameScoresWithThreads, TestUpgradeIndexMergePolicy, TestNamedSPILoader, TestPrefixRandom, TestLucene54DocValuesFormat, TestSpansAdvanced2, TestFixedBitDocIdSet, TestFSTs, TestStressAdvance, TestPriorityQueue, TestFieldReuse, TestBoolean2]
    [smoker] [junit4] Completed [218/422 (1!)] on J1 in 56.83s, 11 tests, 4 failures <<< FAILURES!
    [smoker] [junit4]
    [smoker] [junit4] Suite: org.apache.lucene.index.TestDocumentsWriterStallControl
    [smoker] [junit4] Completed [219/422 (1!)] on J2 in 4.97s, 3 tests
    [smoker] [junit4]
    [smoker] [junit4] Suite: org.apache.lucene.index.TestNeverDelete
    [smoker] [junit4] Completed [220/422 (1!)] on J0 in 2.76s, 1 test
    [smoker] [junit4]
    [smoker] [junit4] Suite: org.apache.lucene.index.TestStressIndexing
    [smoker] [junit4] Completed [221/422 (1!)] on J1 in 3.07s, 1 test
    [smoker] [junit4]
    [smoker] [junit4] Suite: org.apache.lucene.index.TestMergeRateLimiter
    [smoker] [junit4] Completed [222/422 (1!)] on J1 in 0.07s, 1 test
    [smoker] [junit4]
    [smoker] [junit4] Suite: org.apache.lucene.search.TestTopDocsMerge
    [smoker] [junit4] Completed [223/422 (1!)] on J2 in 1.52s, 2 tests
    [smoker] [junit4]
    [smoker] [junit4] Suite: org.apache.lucene.index.TestStressDeletes
    [smoker] [junit4] Completed [224/422 (1!)] on J1 in 0.95s, 1 test
    [smoker] [junit4]
    [smoker] [junit4] Suite: org.apache.lucene.store.TestBufferedChecksum
    [smoker] [junit4] Completed [225/422 (1!)] on J1 in 0.15s, 2 tests
    [smoker] [junit4]
    [smoker] [junit4] Suite: org.apache.lucene.util.automaton.TestMinimize
    [smoker] [junit4] Completed [226/422 (1!)] on J0 in 2.59s, 3 tests
    [smoker] [junit4]
    [smoker] [junit4] Suite: org.apache.lucene.index.TestRollingUpdates
    [smoker] [junit4] Completed [227/422 (1!)] on J2 in 2.14s, 2 tests
    [smoker] [junit4]
    [smoker] [junit4] Suite: org.apache.lucene.util.TestRoaringDocIdSet
    [smoker] [junit4] Completed [228/422 (1!)] on J1 in 2.75s, 5 tests
    [smoker] [junit4]
    [smoker] [junit4] Suite: org.apache.lucene.util.packed.TestDirectPacked
    [smoker] [junit4] Completed [229/422 (1!)] on J1 in 0.98s, 4 tests
    [smoker] [junit4]
    [smoker] [junit4] Suite: org.apache.lucene.search.TestDocTermOrdsRewriteMethod
    [smoker] [junit4] Completed [230/422 (1!)] on J0 in 4.24s, 2 tests
    [smoker] [junit4]
    [smoker] [junit4] Suite: org.apache.lucene.index.TestIndexWriterUnicode
    [smoker] [junit4] Completed [231/422 (1!)] on J2 in 3.93s, 5 tests
    [smoker] [junit4]
    [smoker] [junit4] Suite: org.apache.lucene.index.TestAddIndexes
    [smoker] [junit4] Completed [232/422 (1!)] on J1 in 4.24s, 23 tests
    [smoker] [junit4]
    [smoker] [junit4] Suite: org.apache.lucene.index.TestCrash
    [smoker] [junit4] Completed [233/422 (1!)] on J1 in 0.47s, 5 tests
    [smoker] [junit4]
    [smoker] [junit4] Suite: org.apache.lucene.search.TestSearchAfter
    [smoker] [junit4] Completed [234/422 (1!)] on J1 in 0.37s, 1 test
    [smoker] [junit4]
    [smoker] [junit4] Suite: org.apache.lucene.index.TestIndexWriterForceMerge
    [smoker] [junit4] Completed [235/422 (1!)] on J2 in 3.33s, 4 tests
    [smoker] [junit4]
    [smoker] [junit4] Suite: org.apache.lucene.index.TestTieredMergePolicy
    [smoker] [junit4] Completed [236/422 (1!)] on J0 in 5.14s, 6 tests
    [smoker] [junit4]
    [smoker] [junit4] Suite: org.apache.lucene.index.TestNRTReaderWithThreads
    [smoker] [junit4] Completed [237/422 (1!)] on J1 in 2.08s, 1 test
    [smoker] [junit4]
    [smoker] [junit4] Suite: org.apache.lucene.util.automaton.TestLevenshteinAutomata
    [smoker] [junit4] Completed [238/422 (1!)] on J2 in 2.49s, 4 tests
    [smoker] [junit4]
    [smoker] [junit4] Suite: org.apache.lucene.store.TestBufferedIndexInput
    [smoker] [junit4] Completed [239/422 (1!)] on J2 in 0.51s, 4 tests
    [smoker] [junit4]
    [smoker] [junit4] Suite: org.apache.lucene.codecs.compressing.TestFastDecompressionMode
    [smoker] [junit4] Completed [240/422 (1!)] on J1 in 2.31s, 11 tests
    [smoker] [junit4]
    [smoker] [junit4] Suite: org.apache.lucene.search.TestPrefixFilter
    [smoker] [junit4] Completed [241/422 (1!)] on J1 in 0.04s, 1 test
    [smoker] [junit4]
    [smoker] [junit4] Suite: org.apache.lucene.index.TestSegmentMerger
    [smoker] [junit4] Completed [242/422 (1!)] on J1 in 0.68s, 3 tests
    [smoker] [junit4]
    [smoker] [junit4] Suite: org.apache.lucene.index.TestByteSlices
    [smoker] [junit4] Completed [243/422 (1!)] on J0 in 3.77s, 1 test
    [smoker] [junit4]
    [smoker] [junit4] Suite: org.apache.lucene.search.TestSimpleExplanations
    [smoker] [junit4] Completed [244/422 (1!)] on J2 in 1.86s, 73 tests
    [smoker] [junit4]
    [smoker] [junit4] Suite: org.apache.lucene.index.TestOmitNorms
    [smoker] [junit4] Completed [245/422 (1!)] on J2 in 0.91s, 5 tests
    [smoker] [junit4]
    [smoker] [junit4] Suite: org.apache.lucene.index.TestBagOfPositions
    [smoker] [junit4] Completed [246/422 (1!)] on J0 in 4.27s, 1 test
    [smoker] [junit4]
    [smoker] [junit4] Suite: org.apache.lucene.search.TestRegexpRandom2
    [smoker] [junit4] Completed [247/422 (1!)] on J0 in 1.36s, 1 test
    [smoker] [junit4]
    [smoker] [junit4] Suite: org.apache.lucene.util.TestFixedBitSet
    [smoker] [junit4] Completed [248/422 (1!)] on J2 in 5.46s, 25 tests
    [smoker] [junit4]
    [smoker] [junit4] Suite: org.apache.lucene.index.TestSegmentReader
    [smoker] [junit4] Completed [249/422 (1!)] on J2 in 0.95s, 7 tests
    [smoker] [junit4]
    [smoker] [junit4] Suite: org.apache.lucene.store.TestNRTCachingDirectory
    [smoker] [junit4] IGNOR/A 0.00s J0 | TestNRTCachingDirectory.testFsyncDoesntCreateNewFiles
    [smoker] [junit4] > Assumption #1: test only works for FSDirectory subclasses
    [smoker] [junit4] Completed [250/422 (1!)] on J0 in 4.00s, 43 tests, 1 skipped
    [smoker] [junit4]
    [smoker] [junit4] Suite: org.apache.lucene.util.TestCollectionUtil
    [smoker] [junit4] Completed [251/422 (1!)] on J1 in 11.28s, 4 tests
    [smoker] [junit4]
    [smoker] [junit4] Suite: org.apache.lucene.index.TestSegmentTermDocs
    [smoker] [junit4] Completed [252/422 (1!)] on J1 in 0.74s, 4 tests
    [smoker] [junit4]
    [smoker] [junit4] Suite: org.apache.lucene.search.TestMultiThreadTermVectors
    [smoker] [junit4] Completed [253/422 (1!)] on J0 in 2.69s, 1 test
    [smoker] [junit4]
    [smoker] [junit4] Suite: org.apache.lucene.index.TestPostingsOffsets
    [smoker] [junit4] Completed [254/422 (1!)] on J0 in 1.61s, 13 tests
    [smoker] [junit4]
    [smoker] [junit4] Suite: org.apache.lucene.index.TestTransactionRollback
    [smoker] [junit4] Completed [255/422 (1!)] on J0 in 0.37s, 2 tests
    [smoker] [junit4]
    [smoker] [junit4] Suite: org.apache.lucene.codecs.compressing.TestFastCompressionMode
    [smoker] [junit4] Completed [256/422 (1!)] on J0 in 0.65s, 11 tests
    [smoker] [junit4]
    [smoker] [junit4] Suite: org.apache.lucene.search.TestMultiPhraseQuery
    [smoker] [junit4] Completed [257/422 (1!)] on J0 in 0.29s, 17 tests, 1 skipped
    [smoker] [junit4]
    [smoker] [junit4] Suite: org.apache.lucene.index.TestDocsAndPositions
    [smoker] [junit4] Completed [258/422 (1!)] on J0 in 0.46s, 6 tests
    [smoker] [junit4]
    [smoker] [junit4] Suite: org.apache.lucene.TestMergeSchedulerExternal
    [smoker] [junit4] Completed [259/422 (1!)] on J0 in 0.71s, 2 tests
    [smoker] [junit4]
    [smoker] [junit4] Suite: org.apache.lucene.index.TestTermVectorsWriter
    [smoker] [junit4] Completed [260/422 (1!)] on J0 in 0.14s, 15 tests
    [smoker] [junit4]
    [smoker] [junit4] Suite: org.apache.lucene.index.TestOmitPositions
    [smoker] [junit4] Completed [261/422 (1!)] on J0 in 0.16s, 4 tests
    [smoker] [junit4]
    [smoker] [junit4] Suite: org.apache.lucene.index.TestStressNRT
    [smoker] [junit4] Completed [262/422 (1!)] on J0 in 2.99s, 1 test
    [smoker] [junit4]
    [smoker] [junit4] Suite: org.apache.lucene.search.TestFilteredQuery
    [smoker] [junit4] Completed [263/422 (1!)] on J0 in 0.93s, 11 tests
    [smoker] [junit4]
    [smoker] [junit4] Suite: org.apache.lucene.store.TestHugeRamFile
    [smoker] [junit4] Completed [264/422 (1!)] on J1 in 11.59s, 1 test
    [smoker] [junit4]
    [smoker] [junit4] Suite: org.apache.lucene.index.TestForceMergeForever
    [smoker] [junit4] Completed [265/422 (1!)] on J1 in 0.96s, 1 test
    [smoker] [junit4]
    [smoker] [junit4] Suite: org.apache.lucene.search.TestSloppyPhraseQuery2
    [smoker] [junit4] Completed [266/422 (1!)] on J0 in 2.76s, 9 tests
    [smoker] [junit4]
    [smoker] [junit4] Suite: org.apache.lucene.index.TestOmitTf
    [smoker] [junit4] Completed [267/422 (1!)] on J1 in 0.42s, 6 tests
    [smoker] [junit4]
    [smoker] [junit4] Suite: org.apache.lucene.search.spans.TestNearSpansOrdered
    [smoker] [junit4] Completed [268/422 (1!)] on J0 in 0.12s, 19 tests
    [smoker] [junit4]
    [smoker] [junit4] Suite: org.apache.lucene.index.TestForTooMuchCloning
    [smoker] [junit4] Completed [269/422 (1!)] on J1 in 0.11s, 1 test
    [smoker] [junit4]
    [smoker] [junit4] Suite: org.apache.lucene.search.TestFuzzyQuery
    [smoker] [junit4] Completed [270/422 (1!)] on J1 in 0.09s, 10 tests
    [smoker] [junit4]
    [smoker] [junit4] Suite: org.apache.lucene.index.TestPayloads
    [smoker] [junit4] Completed [271/422 (1!)] on J1 in 0.30s, 7 tests
    [smoker] [junit4]
    [smoker] [junit4] Suite: org.apache.lucene.index.TestDoc
    [smoker] [junit4] Completed [272/422 (1!)] on J1 in 0.38s, 1 test
    [smoker] [junit4]
    [smoker] [junit4] Suite: org.apache.lucene.search.TestWildcard
    [smoker] [junit4] Completed [273/422 (1!)] on J1 in 0.51s, 8 tests
    [smoker] [junit4]
    [smoker] [junit4] Suite: org.apache.lucene.search.similarities.TestSimilarity2
    [smoker] [junit4] Completed [274/422 (1!)] on J1 in 0.15s, 7 tests
    [smoker] [junit4]
    [smoker] [junit4] Suite: org.apache.lucene.search.TestTermRangeFilter
    [smoker] [junit4] Completed [275/422 (1!)] on J1 in 2.30s, 3 tests
    [smoker] [junit4]
    [smoker] [junit4] Suite: org.apache.lucene.search.TestSimpleExplanationsOfNonMatches
    [smoker] [junit4] Completed [276/422 (1!)] on J1 in 0.42s, 73 tests
    [smoker] [junit4]
    [smoker] [junit4] Suite: org.apache.lucene.search.spans.TestSpanSearchEquivalence
    [smoker] [junit4] Completed [277/422 (1!)] on J0 in 5.52s, 33 tests
    [smoker] [junit4]
    [smoker] [junit4] Suite: org.apache.lucene.index.TestPerSegmentDeletes
    [smoker] [junit4] Completed [278/422 (1!)] on J1 in 0.04s, 1 test
    [smoker] [junit4]
    [smoker] [junit4] Suite: org.apache.lucene.index.TestIntBlockPool
    [smoker] [junit4] Completed [279/422 (1!)] on J1 in 0.55s, 2 tests
    [smoker] [junit4]
    [smoker] [junit4] Suite: org.apache.lucene.search.TestTopDocsCollector
    [smoker] [junit4] Completed [280/422 (1!)] on J1 in 0.12s, 8 tests
    [smoker] [junit4]
    [smoker] [junit4] Suite: org.apache.lucene.search.TestMultiValuedNumericRangeQuery
    [smoker] [junit4] Completed [281/422 (1!)] on J0 in 1.12s, 1 test
    [smoker] [junit4]
    [smoker] [junit4] Suite: org.apache.lucene.index.TestSegmentTermEnum
    [smoker] [junit4] Completed [282/422 (1!)] on J1 in 0.13s, 2 tests
    [smoker] [junit4]
    [smoker] [junit4] Suite: org.apache.lucene.index.TestUniqueTermCount
    [smoker] [junit4] Completed [283/422 (1!)] on J0 in 0.17s, 1 test
    [smoker] [junit4]
    [smoker] [junit4] Suite: org.apache.lucene.search.TestComplexExplanationsOfNonMatches
    [

[...truncated too long message...]

h.spans.TestSpanCollection
    [smoker] [junit4] Completed [397/422 (1!)] on J0 in 0.02s, 3 tests
    [smoker] [junit4]
    [smoker] [junit4] Suite: org.apache.lucene.search.spans.TestSpanNearQuery
    [smoker] [junit4] Completed [398/422 (1!)] on J2 in 0.02s, 4 tests
    [smoker] [junit4]
    [smoker] [junit4] Suite: org.apache.lucene.search.spans.TestSpanNotQuery
    [smoker] [junit4] Completed [399/422 (1!)] on J0 in 0.01s, 3 tests
    [smoker] [junit4]
    [smoker] [junit4] Suite: org.apache.lucene.search.spans.TestSpanOrQuery
    [smoker] [junit4] Completed [400/422 (1!)] on J2 in 0.01s, 3 tests
    [smoker] [junit4]
    [smoker] [junit4] Suite: org.apache.lucene.search.spans.TestSpanTermQuery
    [smoker] [junit4] Completed [401/422 (1!)] on J0 in 0.01s, 2 tests
    [smoker] [junit4]
    [smoker] [junit4] Suite: org.apache.lucene.search.spans.TestSpansEnum
    [smoker] [junit4] Completed [402/422 (1!)] on J2 in 0.04s, 7 tests
    [smoker] [junit4]
    [smoker] [junit4] Suite: org.apache.lucene.store.TestFilterDirectory
    [smoker] [junit4] IGNOR/A 0.00s J0 | TestFilterDirectory.testFsyncDoesntCreateNewFiles
    [smoker] [junit4] > Assumption #1: test only works for FSDirectory subclasses
    [smoker] [junit4] Completed [403/422 (1!)] on J0 in 0.22s, 44 tests, 1 skipped
    [smoker] [junit4]
    [smoker] [junit4] Suite: org.apache.lucene.store.TestNIOFSDirectory
    [smoker] [junit4] Completed [404/422 (1!)] on J2 in 1.00s, 42 tests
    [smoker] [junit4]
    [smoker] [junit4] Suite: org.apache.lucene.store.TestSimpleFSDirectory
    [smoker] [junit4] Completed [405/422 (1!)] on J2 in 1.18s, 42 tests
    [smoker] [junit4]
    [smoker] [junit4] Suite: org.apache.lucene.store.TestSingleInstanceLockFactory
    [smoker] [junit4] Completed [406/422 (1!)] on J2 in 3.49s, 7 tests
    [smoker] [junit4]
    [smoker] [junit4] Suite: org.apache.lucene.store.TestTrackingDirectoryWrapper
    [smoker] [junit4] IGNOR/A 0.00s J2 | TestTrackingDirectoryWrapper.testFsyncDoesntCreateNewFiles
    [smoker] [junit4] > Assumption #1: test only works for FSDirectory subclasses
    [smoker] [junit4] Completed [407/422 (1!)] on J2 in 1.32s, 47 tests, 1 skipped
    [smoker] [junit4]
    [smoker] [junit4] Suite: org.apache.lucene.util.TestBytesRefArray
    [smoker] [junit4] Completed [408/422 (1!)] on J2 in 0.06s, 2 tests
    [smoker] [junit4]
    [smoker] [junit4] Suite: org.apache.lucene.util.TestCharsRefBuilder
    [smoker] [junit4] Completed [409/422 (1!)] on J2 in 0.02s, 2 tests
    [smoker] [junit4]
    [smoker] [junit4] Suite: org.apache.lucene.util.TestIntArrayDocIdSet
    [smoker] [junit4] Completed [410/422 (1!)] on J2 in 1.09s, 5 tests
    [smoker] [junit4]
    [smoker] [junit4] Suite: org.apache.lucene.store.TestNativeFSLockFactory
    [smoker] [junit4] IGNOR/A 0.00s J0 | TestNativeFSLockFactory.testDeleteLockFile
    [smoker] [junit4] > Assumption #1: test requires the ability to delete a locked file(throwable: java.io.IOException: cannot delete file: test.lock, a virus scanner has it open)
    [smoker] [junit4] Completed [411/422 (1!)] on J0 in 10.33s, 10 tests, 1 skipped
    [smoker] [junit4]
    [smoker] [junit4] Suite: org.apache.lucene.util.TestLongBitSet
    [smoker] [junit4] IGNOR/A 0.00s J2 | TestLongBitSet.testHugeCapacity
    [smoker] [junit4] > Assumption #1: 'nightly' test group is disabled (@Nightly())
    [smoker] [junit4] Completed [412/422 (1!)] on J2 in 0.80s, 9 tests, 1 skipped
    [smoker] [junit4]
    [smoker] [junit4] Suite: org.apache.lucene.util.TestMergedIterator
    [smoker] [junit4] Completed [413/422 (1!)] on J0 in 0.62s, 25 tests
    [smoker] [junit4]
    [smoker] [junit4] Suite: org.apache.lucene.util.TestStringHelper
    [smoker] [junit4] Completed [414/422 (1!)] on J0 in 0.05s, 7 tests
    [smoker] [junit4]
    [smoker] [junit4] Suite: org.apache.lucene.util.TestTimSorter
    [smoker] [junit4] Completed [415/422 (1!)] on J0 in 0.29s, 9 tests
    [smoker] [junit4]
    [smoker] [junit4] Suite: org.apache.lucene.util.TestTimSorterWorstCase
    [smoker] [junit4] IGNOR/A 0.00s J0 | TestTimSorterWorstCase.testWorstCaseStackSize
    [smoker] [junit4] > Assumption #1: 'slow' test group is disabled (@Slow())
    [smoker] [junit4] Completed [416/422 (1!)] on J0 in 0.00s, 1 test, 1 skipped
    [smoker] [junit4]
    [smoker] [junit4] Suite: org.apache.lucene.util.automaton.LimitedFiniteStringsIteratorTest
    [smoker] [junit4] Completed [417/422 (1!)] on J0 in 0.06s, 6 tests
    [smoker] [junit4]
    [smoker] [junit4] Suite: org.apache.lucene.util.automaton.TestRegExp
    [smoker] [junit4] Completed [418/422 (1!)] on J0 in 0.11s, 5 tests
    [smoker] [junit4]
    [smoker] [junit4] Suite: org.apache.lucene.util.mutable.TestMutableValues
    [smoker] [junit4] Completed [419/422 (1!)] on J0 in 0.02s, 6 tests
    [smoker] [junit4]
    [smoker] [junit4] Suite: org.apache.lucene.util.TestSparseFixedBitSet
    [smoker] [junit4] Completed [420/422 (1!)] on J2 in 4.01s, 17 tests
    [smoker] [junit4]
    [smoker] [junit4] Suite: org.apache.lucene.util.packed.TestDirectMonotonic
    [smoker] [junit4] Completed [421/422 (1!)] on J0 in 2.11s, 4 tests
    [smoker] [junit4]
    [smoker] [junit4] HEARTBEAT J1 PID(30996@localhost): 2016-06-17T05:08:54, stalled for 62.4s at: TestGrowableByteArrayDataOutput.testWriteLargeStrings
    [smoker] [junit4] Suite: org.apache.lucene.codecs.compressing.TestGrowableByteArrayDataOutput
    [smoker] [junit4] Completed [422/422 (1!)] on J1 in 75.84s, 2 tests
    [smoker] [junit4]
    [smoker] [junit4]
    [smoker] [junit4] Tests with failures [seed: 3CAB6CBA18152C51]:
    [smoker] [junit4] - org.apache.lucene.search.TestBoolean2.testQueries08
    [smoker] [junit4] - org.apache.lucene.search.TestBoolean2.testQueries03
    [smoker] [junit4] - org.apache.lucene.search.TestBoolean2.testQueries02
    [smoker] [junit4] - org.apache.lucene.search.TestBoolean2.testQueries01
    [smoker] [junit4]
    [smoker] [junit4]
    [smoker] [junit4] JVM J0: 0.46 .. 427.18 = 426.73s
    [smoker] [junit4] JVM J1: 0.73 .. 446.69 = 445.96s
    [smoker] [junit4] JVM J2: 0.71 .. 426.68 = 425.96s
    [smoker] [junit4] Execution time total: 7 minutes 26 seconds
    [smoker] [junit4] Tests summary: 422 suites (1 ignored), 3464 tests, 4 failures, 108 ignored (104 assumptions)
    [smoker]
    [smoker] BUILD FAILED
    [smoker] /x1/jenkins/jenkins-slave/workspace/Lucene-Solr-SmokeRelease-5.5/lucene/build/smokeTestRelease/tmp/unpack/lucene-5.5.2/build.xml:50: The following error occurred while executing this line:
    [smoker] /x1/jenkins/jenkins-slave/workspace/Lucene-Solr-SmokeRelease-5.5/lucene/build/smokeTestRelease/tmp/unpack/lucene-5.5.2/common-build.xml:1477: The following error occurred while executing this line:
    [smoker] /x1/jenkins/jenkins-slave/workspace/Lucene-Solr-SmokeRelease-5.5/lucene/build/smokeTestRelease/tmp/unpack/lucene-5.5.2/common-build.xml:1033: There were test failures: 422 suites (1 ignored), 3464 tests, 4 failures, 108 ignored (104 assumptions) [seed: 3CAB6CBA18152C51]
    [smoker]
    [smoker] Total time: 7 minutes 42 seconds
    [smoker]
    [smoker]
    [smoker] Traceback (most recent call last):
    [smoker] File "/x1/jenkins/jenkins-slave/workspace/Lucene-Solr-SmokeRelease-5.5/dev-tools/scripts/smokeTestRelease.py", line 1443, in <module>
    [smoker] main()
    [smoker] File "/x1/jenkins/jenkins-slave/workspace/Lucene-Solr-SmokeRelease-5.5/dev-tools/scripts/smokeTestRelease.py", line 1387, in main
    [smoker] smokeTest(c.java, c.url, c.revision, c.version, c.tmp_dir, c.is_signed, ' '.join(c.test_args))
    [smoker] File "/x1/jenkins/jenkins-slave/workspace/Lucene-Solr-SmokeRelease-5.5/dev-tools/scripts/smokeTestRelease.py", line 1425, in smokeTest
    [smoker] unpackAndVerify(java, 'lucene', tmpDir, 'lucene-%s-src.tgz' % version, gitRevision, version, testArgs, baseURL)
    [smoker] File "/x1/jenkins/jenkins-slave/workspace/Lucene-Solr-SmokeRelease-5.5/dev-tools/scripts/smokeTestRelease.py", line 589, in unpackAndVerify
    [smoker] verifyUnpacked(java, project, artifact, unpackPath, gitRevision, version, testArgs, tmpDir, baseURL)
    [smoker] File "/x1/jenkins/jenkins-slave/workspace/Lucene-Solr-SmokeRelease-5.5/dev-tools/scripts/smokeTestRelease.py", line 682, in verifyUnpacked
    [smoker] java.run_java7('ant clean test %s' % testArgs, '%s/test.log' % unpackPath)
    [smoker] File "/x1/jenkins/jenkins-slave/workspace/Lucene-Solr-SmokeRelease-5.5/dev-tools/scripts/smokeTestRelease.py", line 1212, in run_java
    [smoker] run('%s; %s' % (cmd_prefix, cmd), logfile)
    [smoker] File "/x1/jenkins/jenkins-slave/workspace/Lucene-Solr-SmokeRelease-5.5/dev-tools/scripts/smokeTestRelease.py", line 514, in run
    [smoker] raise RuntimeError('command "%s" failed; see log file %s' % (command, logPath))
    [smoker] RuntimeError: command "export JAVA_HOME="/home/jenkins/jenkins-slave/tools/hudson.model.JDK/latest1.7" PATH="/home/jenkins/jenkins-slave/tools/hudson.model.JDK/latest1.7/bin:$PATH" JAVACMD="/home/jenkins/jenkins-slave/tools/hudson.model.JDK/latest1.7/bin/java"; ant clean test -Dtests.slow=false" failed; see log file /x1/jenkins/jenkins-slave/workspace/Lucene-Solr-SmokeRelease-5.5/lucene/build/smokeTestRelease/tmp/unpack/lucene-5.5.2/test.log

BUILD FAILED
/x1/jenkins/jenkins-slave/workspace/Lucene-Solr-SmokeRelease-5.5/build.xml:545: exec returned: 1

Total time: 17 minutes 41 seconds
Build step 'Invoke Ant' marked build as failure
Email was triggered for: Failure - Any
Sending email for trigger: Failure - Any
Setting LATEST1_8_HOME=/home/jenkins/jenkins-slave/tools/hudson.model.JDK/latest1.8
Setting LATEST1_8_HOME=/home/jenkins/jenkins-slave/tools/hudson.model.JDK/latest1.8

Search Discussions

  • Apache Jenkins Server at Jun 18, 2016 at 10:24 am
    Build: https://builds.apache.org/job/Lucene-Solr-SmokeRelease-5.5/17/

    No tests ran.

    Build Log:
    [...truncated 39773 lines...]
    prepare-release-no-sign:
         [mkdir] Created dir: /x1/jenkins/jenkins-slave/workspace/Lucene-Solr-SmokeRelease-5.5/lucene/build/smokeTestRelease/dist
          [copy] Copying 461 files to /x1/jenkins/jenkins-slave/workspace/Lucene-Solr-SmokeRelease-5.5/lucene/build/smokeTestRelease/dist/lucene
          [copy] Copying 245 files to /x1/jenkins/jenkins-slave/workspace/Lucene-Solr-SmokeRelease-5.5/lucene/build/smokeTestRelease/dist/solr
        [smoker] Java 1.7 JAVA_HOME=/home/jenkins/jenkins-slave/tools/hudson.model.JDK/latest1.7
        [smoker] Java 1.8 JAVA_HOME=/home/jenkins/jenkins-slave/tools/hudson.model.JDK/latest1.8
        [smoker] NOTE: output encoding is UTF-8
        [smoker]
        [smoker] Load release URL "file:/x1/jenkins/jenkins-slave/workspace/Lucene-Solr-SmokeRelease-5.5/lucene/build/smokeTestRelease/dist/"...
        [smoker]
        [smoker] Test Lucene...
        [smoker] test basics...
        [smoker] get KEYS
        [smoker] 0.2 MB in 0.01 sec (18.5 MB/sec)
        [smoker] check changes HTML...
        [smoker] download lucene-5.5.2-src.tgz...
        [smoker] 28.7 MB in 0.03 sec (1111.6 MB/sec)
        [smoker] verify md5/sha1 digests
        [smoker] download lucene-5.5.2.tgz...
        [smoker] 63.5 MB in 0.05 sec (1178.9 MB/sec)
        [smoker] verify md5/sha1 digests
        [smoker] download lucene-5.5.2.zip...
        [smoker] 73.9 MB in 0.06 sec (1193.9 MB/sec)
        [smoker] verify md5/sha1 digests
        [smoker] unpack lucene-5.5.2.tgz...
        [smoker] verify JAR metadata/identity/no javax.* or java.* classes...
        [smoker] test demo with 1.7...
        [smoker] got 6190 hits for query "lucene"
        [smoker] checkindex with 1.7...
        [smoker] test demo with 1.8...
        [smoker] got 6190 hits for query "lucene"
        [smoker] checkindex with 1.8...
        [smoker] check Lucene's javadoc JAR
        [smoker] unpack lucene-5.5.2.zip...
        [smoker] verify JAR metadata/identity/no javax.* or java.* classes...
        [smoker] test demo with 1.7...
        [smoker] got 6190 hits for query "lucene"
        [smoker] checkindex with 1.7...
        [smoker] test demo with 1.8...
        [smoker] got 6190 hits for query "lucene"
        [smoker] checkindex with 1.8...
        [smoker] check Lucene's javadoc JAR
        [smoker] unpack lucene-5.5.2-src.tgz...
        [smoker] make sure no JARs/WARs in src dist...
        [smoker] run "ant validate"
        [smoker] run tests w/ Java 7 and testArgs='-Dtests.slow=false'...
        [smoker] test demo with 1.7...
        [smoker] got 220 hits for query "lucene"
        [smoker] checkindex with 1.7...
        [smoker] generate javadocs w/ Java 7...
        [smoker]
        [smoker] Crawl/parse...
        [smoker]
        [smoker] Verify...
        [smoker] run tests w/ Java 8 and testArgs='-Dtests.slow=false'...
        [smoker] test demo with 1.8...
        [smoker] got 220 hits for query "lucene"
        [smoker] checkindex with 1.8...
        [smoker] generate javadocs w/ Java 8...
        [smoker]
        [smoker] Crawl/parse...
        [smoker]
        [smoker] Verify...
        [smoker] confirm all releases have coverage in TestBackwardsCompatibility
        [smoker] find all past Lucene releases...
        [smoker] run TestBackwardsCompatibility..
        [smoker] Backcompat testing not required for release 6.0.1 because it's not less than 5.5.2
        [smoker] Backcompat testing not required for release 6.0.0 because it's not less than 5.5.2
        [smoker] Backcompat testing not required for release 6.1.0 because it's not less than 5.5.2
        [smoker] success!
        [smoker]
        [smoker] Test Solr...
        [smoker] test basics...
        [smoker] get KEYS
        [smoker] 0.2 MB in 0.00 sec (31.7 MB/sec)
        [smoker] check changes HTML...
        [smoker] download solr-5.5.2-src.tgz...
        [smoker] 37.6 MB in 0.27 sec (138.0 MB/sec)
        [smoker] verify md5/sha1 digests
        [smoker] download solr-5.5.2.tgz...
        [smoker] 130.5 MB in 2.33 sec (56.0 MB/sec)
        [smoker] verify md5/sha1 digests
        [smoker] download solr-5.5.2.zip...
        [smoker] 138.4 MB in 2.42 sec (57.1 MB/sec)
        [smoker] verify md5/sha1 digests
        [smoker] unpack solr-5.5.2.tgz...
        [smoker] verify JAR metadata/identity/no javax.* or java.* classes...
        [smoker] unpack lucene-5.5.2.tgz...
        [smoker] **WARNING**: skipping check of /x1/jenkins/jenkins-slave/workspace/Lucene-Solr-SmokeRelease-5.5/lucene/build/smokeTestRelease/tmp/unpack/solr-5.5.2/contrib/dataimporthandler-extras/lib/javax.mail-1.5.1.jar: it has javax.* classes
        [smoker] **WARNING**: skipping check of /x1/jenkins/jenkins-slave/workspace/Lucene-Solr-SmokeRelease-5.5/lucene/build/smokeTestRelease/tmp/unpack/solr-5.5.2/contrib/dataimporthandler-extras/lib/activation-1.1.1.jar: it has javax.* classes
        [smoker] copying unpacked distribution for Java 7 ...
        [smoker] test solr example w/ Java 7...
        [smoker] start Solr instance (log=/x1/jenkins/jenkins-slave/workspace/Lucene-Solr-SmokeRelease-5.5/lucene/build/smokeTestRelease/tmp/unpack/solr-5.5.2-java7/solr-example.log)...
        [smoker] No process found for Solr node running on port 8983
        [smoker] Running techproducts example on port 8983 from /x1/jenkins/jenkins-slave/workspace/Lucene-Solr-SmokeRelease-5.5/lucene/build/smokeTestRelease/tmp/unpack/solr-5.5.2-java7
        [smoker] Creating Solr home directory /x1/jenkins/jenkins-slave/workspace/Lucene-Solr-SmokeRelease-5.5/lucene/build/smokeTestRelease/tmp/unpack/solr-5.5.2-java7/example/techproducts/solr
        [smoker]
        [smoker] Starting up Solr on port 8983 using command:
        [smoker] bin/solr start -p 8983 -s "example/techproducts/solr"
        [smoker]
        [smoker] Waiting up to 30 seconds to see Solr running on port 8983 [|]  [/]  [-]  [\]  [|]  [/]  [-]  [\]  [|]  [/]  [-]
        [smoker] Started Solr server on port 8983 (pid=3187). Happy searching!
        [smoker]
        [smoker]  
        [smoker] Copying configuration to new core instance directory:
        [smoker] /x1/jenkins/jenkins-slave/workspace/Lucene-Solr-SmokeRelease-5.5/lucene/build/smokeTestRelease/tmp/unpack/solr-5.5.2-java7/example/techproducts/solr/techproducts
        [smoker]
        [smoker] Creating new core 'techproducts' using command:
        [smoker] http://localhost:8983/solr/admin/cores?action=CREATE&name=techproducts&instanceDir=techproducts
        [smoker]
        [smoker] {
        [smoker] "responseHeader":{
        [smoker] "status":0,
        [smoker] "QTime":1986},
        [smoker] "core":"techproducts"}
        [smoker]
        [smoker]
        [smoker] Indexing tech product example docs from /x1/jenkins/jenkins-slave/workspace/Lucene-Solr-SmokeRelease-5.5/lucene/build/smokeTestRelease/tmp/unpack/solr-5.5.2-java7/example/exampledocs
        [smoker] SimplePostTool version 5.0.0
        [smoker] Posting files to [base] url http://localhost:8983/solr/techproducts/update using content-type application/xml...
        [smoker] POSTing file money.xml to [base]
        [smoker] POSTing file mem.xml to [base]
        [smoker] POSTing file vidcard.xml to [base]
        [smoker] POSTing file ipod_video.xml to [base]
        [smoker] POSTing file sd500.xml to [base]
        [smoker] POSTing file gb18030-example.xml to [base]
        [smoker] POSTing file mp500.xml to [base]
        [smoker] POSTing file monitor2.xml to [base]
        [smoker] POSTing file utf8-example.xml to [base]
        [smoker] POSTing file manufacturers.xml to [base]
        [smoker] POSTing file hd.xml to [base]
        [smoker] POSTing file solr.xml to [base]
        [smoker] POSTing file monitor.xml to [base]
        [smoker] POSTing file ipod_other.xml to [base]
        [smoker] 14 files indexed.
        [smoker] COMMITting Solr index changes to http://localhost:8983/solr/techproducts/update...
        [smoker] Time spent: 0:00:00.367
        [smoker]
        [smoker] Solr techproducts example launched successfully. Direct your Web browser to http://localhost:8983/solr to visit the Solr Admin UI
        [smoker] test utf8...
        [smoker] run query...
        [smoker] stop server using: bin/solr stop -p 8983
        [smoker] Sending stop command to Solr running on port 8983 ... waiting 5 seconds to allow Jetty process 3187 to stop gracefully.
        [smoker] [|]  [/]  [-]  [\]  [|]  [/]  [-]  [\]  [|]  [/]   copying unpacked distribution for Java 8 ...
        [smoker] test solr example w/ Java 8...
        [smoker] start Solr instance (log=/x1/jenkins/jenkins-slave/workspace/Lucene-Solr-SmokeRelease-5.5/lucene/build/smokeTestRelease/tmp/unpack/solr-5.5.2-java8/solr-example.log)...
        [smoker] No process found for Solr node running on port 8983
        [smoker] Running techproducts example on port 8983 from /x1/jenkins/jenkins-slave/workspace/Lucene-Solr-SmokeRelease-5.5/lucene/build/smokeTestRelease/tmp/unpack/solr-5.5.2-java8
        [smoker] Creating Solr home directory /x1/jenkins/jenkins-slave/workspace/Lucene-Solr-SmokeRelease-5.5/lucene/build/smokeTestRelease/tmp/unpack/solr-5.5.2-java8/example/techproducts/solr
        [smoker]
        [smoker] Starting up Solr on port 8983 using command:
        [smoker] bin/solr start -p 8983 -s "example/techproducts/solr"
        [smoker]
        [smoker] Waiting up to 30 seconds to see Solr running on port 8983 [|]  [/]  [-]  [\]  [|]  [/]  [-]  [\]  [|]  [/]  [-]
        [smoker] Started Solr server on port 8983 (pid=3579). Happy searching!
        [smoker]
        [smoker]  
        [smoker] Copying configuration to new core instance directory:
        [smoker] /x1/jenkins/jenkins-slave/workspace/Lucene-Solr-SmokeRelease-5.5/lucene/build/smokeTestRelease/tmp/unpack/solr-5.5.2-java8/example/techproducts/solr/techproducts
        [smoker]
        [smoker] Creating new core 'techproducts' using command:
        [smoker] http://localhost:8983/solr/admin/cores?action=CREATE&name=techproducts&instanceDir=techproducts
        [smoker]
        [smoker] {
        [smoker] "responseHeader":{
        [smoker] "status":0,
        [smoker] "QTime":1735},
        [smoker] "core":"techproducts"}
        [smoker]
        [smoker]
        [smoker] Indexing tech product example docs from /x1/jenkins/jenkins-slave/workspace/Lucene-Solr-SmokeRelease-5.5/lucene/build/smokeTestRelease/tmp/unpack/solr-5.5.2-java8/example/exampledocs
        [smoker] SimplePostTool version 5.0.0
        [smoker] Posting files to [base] url http://localhost:8983/solr/techproducts/update using content-type application/xml...
        [smoker] POSTing file money.xml to [base]
        [smoker] POSTing file mem.xml to [base]
        [smoker] POSTing file vidcard.xml to [base]
        [smoker] POSTing file ipod_video.xml to [base]
        [smoker] POSTing file sd500.xml to [base]
        [smoker] POSTing file gb18030-example.xml to [base]
        [smoker] POSTing file mp500.xml to [base]
        [smoker] POSTing file monitor2.xml to [base]
        [smoker] POSTing file utf8-example.xml to [base]
        [smoker] POSTing file manufacturers.xml to [base]
        [smoker] POSTing file hd.xml to [base]
        [smoker] POSTing file solr.xml to [base]
        [smoker] POSTing file monitor.xml to [base]
        [smoker] POSTing file ipod_other.xml to [base]
        [smoker] 14 files indexed.
        [smoker] COMMITting Solr index changes to http://localhost:8983/solr/techproducts/update...
        [smoker] Time spent: 0:00:00.397
        [smoker]
        [smoker] Solr techproducts example launched successfully. Direct your Web browser to http://localhost:8983/solr to visit the Solr Admin UI
        [smoker] test utf8...
        [smoker] run query...
        [smoker] stop server using: bin/solr stop -p 8983
        [smoker] Sending stop command to Solr running on port 8983 ... waiting 5 seconds to allow Jetty process 3579 to stop gracefully.
        [smoker] [|]  [/]  [-]  [\]  [|]  [/]  [-]  [\]  [|]  [/]   unpack solr-5.5.2.zip...
        [smoker] verify JAR metadata/identity/no javax.* or java.* classes...
        [smoker] unpack lucene-5.5.2.tgz...
        [smoker] **WARNING**: skipping check of /x1/jenkins/jenkins-slave/workspace/Lucene-Solr-SmokeRelease-5.5/lucene/build/smokeTestRelease/tmp/unpack/solr-5.5.2/contrib/dataimporthandler-extras/lib/javax.mail-1.5.1.jar: it has javax.* classes
        [smoker] **WARNING**: skipping check of /x1/jenkins/jenkins-slave/workspace/Lucene-Solr-SmokeRelease-5.5/lucene/build/smokeTestRelease/tmp/unpack/solr-5.5.2/contrib/dataimporthandler-extras/lib/activation-1.1.1.jar: it has javax.* classes
        [smoker] copying unpacked distribution for Java 7 ...
        [smoker] test solr example w/ Java 7...
        [smoker] start Solr instance (log=/x1/jenkins/jenkins-slave/workspace/Lucene-Solr-SmokeRelease-5.5/lucene/build/smokeTestRelease/tmp/unpack/solr-5.5.2-java7/solr-example.log)...
        [smoker] No process found for Solr node running on port 8983
        [smoker] Running techproducts example on port 8983 from /x1/jenkins/jenkins-slave/workspace/Lucene-Solr-SmokeRelease-5.5/lucene/build/smokeTestRelease/tmp/unpack/solr-5.5.2-java7
        [smoker] Creating Solr home directory /x1/jenkins/jenkins-slave/workspace/Lucene-Solr-SmokeRelease-5.5/lucene/build/smokeTestRelease/tmp/unpack/solr-5.5.2-java7/example/techproducts/solr
        [smoker]
        [smoker] Starting up Solr on port 8983 using command:
        [smoker] bin/solr start -p 8983 -s "example/techproducts/solr"
        [smoker]
        [smoker] Waiting up to 30 seconds to see Solr running on port 8983 [|]  [/]  [-]  [\]  [|]  [/]  [-]  [\]  [|]  [/]  [-]
        [smoker] Started Solr server on port 8983 (pid=3985). Happy searching!
        [smoker]
        [smoker]  
        [smoker] Copying configuration to new core instance directory:
        [smoker] /x1/jenkins/jenkins-slave/workspace/Lucene-Solr-SmokeRelease-5.5/lucene/build/smokeTestRelease/tmp/unpack/solr-5.5.2-java7/example/techproducts/solr/techproducts
        [smoker]
        [smoker] Creating new core 'techproducts' using command:
        [smoker] http://localhost:8983/solr/admin/cores?action=CREATE&name=techproducts&instanceDir=techproducts
        [smoker]
        [smoker] {
        [smoker] "responseHeader":{
        [smoker] "status":0,
        [smoker] "QTime":1828},
        [smoker] "core":"techproducts"}
        [smoker]
        [smoker]
        [smoker] Indexing tech product example docs from /x1/jenkins/jenkins-slave/workspace/Lucene-Solr-SmokeRelease-5.5/lucene/build/smokeTestRelease/tmp/unpack/solr-5.5.2-java7/example/exampledocs
        [smoker] SimplePostTool version 5.0.0
        [smoker] Posting files to [base] url http://localhost:8983/solr/techproducts/update using content-type application/xml...
        [smoker] POSTing file money.xml to [base]
        [smoker] POSTing file mem.xml to [base]
        [smoker] POSTing file vidcard.xml to [base]
        [smoker] POSTing file ipod_video.xml to [base]
        [smoker] POSTing file sd500.xml to [base]
        [smoker] POSTing file gb18030-example.xml to [base]
        [smoker] POSTing file mp500.xml to [base]
        [smoker] POSTing file monitor2.xml to [base]
        [smoker] POSTing file utf8-example.xml to [base]
        [smoker] POSTing file manufacturers.xml to [base]
        [smoker] POSTing file hd.xml to [base]
        [smoker] POSTing file solr.xml to [base]
        [smoker] POSTing file monitor.xml to [base]
        [smoker] POSTing file ipod_other.xml to [base]
        [smoker] 14 files indexed.
        [smoker] COMMITting Solr index changes to http://localhost:8983/solr/techproducts/update...
        [smoker] Time spent: 0:00:00.363
        [smoker]
        [smoker] Solr techproducts example launched successfully. Direct your Web browser to http://localhost:8983/solr to visit the Solr Admin UI
        [smoker] test utf8...
        [smoker] run query...
        [smoker] stop server using: bin/solr stop -p 8983
        [smoker] Sending stop command to Solr running on port 8983 ... waiting 5 seconds to allow Jetty process 3985 to stop gracefully.
        [smoker] [|]  [/]  [-]  [\]  [|]  [/]  [-]  [\]  [|]  [/]   copying unpacked distribution for Java 8 ...
        [smoker] test solr example w/ Java 8...
        [smoker] start Solr instance (log=/x1/jenkins/jenkins-slave/workspace/Lucene-Solr-SmokeRelease-5.5/lucene/build/smokeTestRelease/tmp/unpack/solr-5.5.2-java8/solr-example.log)...
        [smoker] No process found for Solr node running on port 8983
        [smoker] Running techproducts example on port 8983 from /x1/jenkins/jenkins-slave/workspace/Lucene-Solr-SmokeRelease-5.5/lucene/build/smokeTestRelease/tmp/unpack/solr-5.5.2-java8
        [smoker] Creating Solr home directory /x1/jenkins/jenkins-slave/workspace/Lucene-Solr-SmokeRelease-5.5/lucene/build/smokeTestRelease/tmp/unpack/solr-5.5.2-java8/example/techproducts/solr
        [smoker]
        [smoker] Starting up Solr on port 8983 using command:
        [smoker] bin/solr start -p 8983 -s "example/techproducts/solr"
        [smoker]
        [smoker] Waiting up to 30 seconds to see Solr running on port 8983 [|]  [/]  [-]  [\]  [|]  [/]  [-]  [\]  [|]  [/]  [-]
        [smoker] Started Solr server on port 8983 (pid=4389). Happy searching!
        [smoker]
        [smoker]  
        [smoker] Copying configuration to new core instance directory:
        [smoker] /x1/jenkins/jenkins-slave/workspace/Lucene-Solr-SmokeRelease-5.5/lucene/build/smokeTestRelease/tmp/unpack/solr-5.5.2-java8/example/techproducts/solr/techproducts
        [smoker]
        [smoker] Creating new core 'techproducts' using command:
        [smoker] http://localhost:8983/solr/admin/cores?action=CREATE&name=techproducts&instanceDir=techproducts
        [smoker]
        [smoker] {
        [smoker] "responseHeader":{
        [smoker] "status":0,
        [smoker] "QTime":1974},
        [smoker] "core":"techproducts"}
        [smoker]
        [smoker]
        [smoker] Indexing tech product example docs from /x1/jenkins/jenkins-slave/workspace/Lucene-Solr-SmokeRelease-5.5/lucene/build/smokeTestRelease/tmp/unpack/solr-5.5.2-java8/example/exampledocs
        [smoker] SimplePostTool version 5.0.0
        [smoker] Posting files to [base] url http://localhost:8983/solr/techproducts/update using content-type application/xml...
        [smoker] POSTing file money.xml to [base]
        [smoker] POSTing file mem.xml to [base]
        [smoker] POSTing file vidcard.xml to [base]
        [smoker] POSTing file ipod_video.xml to [base]
        [smoker] POSTing file sd500.xml to [base]
        [smoker] POSTing file gb18030-example.xml to [base]
        [smoker] POSTing file mp500.xml to [base]
        [smoker] POSTing file monitor2.xml to [base]
        [smoker] POSTing file utf8-example.xml to [base]
        [smoker] POSTing file manufacturers.xml to [base]
        [smoker] POSTing file hd.xml to [base]
        [smoker] POSTing file solr.xml to [base]
        [smoker] POSTing file monitor.xml to [base]
        [smoker] POSTing file ipod_other.xml to [base]
        [smoker] 14 files indexed.
        [smoker] COMMITting Solr index changes to http://localhost:8983/solr/techproducts/update...
        [smoker] Time spent: 0:00:00.354
        [smoker]
        [smoker] Solr techproducts example launched successfully. Direct your Web browser to http://localhost:8983/solr to visit the Solr Admin UI
        [smoker] test utf8...
        [smoker] run query...
        [smoker] stop server using: bin/solr stop -p 8983
        [smoker] Sending stop command to Solr running on port 8983 ... waiting 5 seconds to allow Jetty process 4389 to stop gracefully.
        [smoker] [|]  [/]  [-]  [\]  [|]  [/]  [-]  [\]  [|]  [/]   unpack solr-5.5.2-src.tgz...
        [smoker] make sure no JARs/WARs in src dist...
        [smoker] run "ant validate"
        [smoker] run tests w/ Java 7 and testArgs='-Dtests.slow=false'...
        [smoker] generate javadocs w/ Java 7...
        [smoker]
        [smoker] /x1/jenkins/jenkins-slave/workspace/Lucene-Solr-SmokeRelease-5.5/lucene/build/smokeTestRelease/tmp/unpack/solr-5.5.2/solr/build/docs/solr-uima/org/apache/solr/uima/processor/package-summary.html
        [smoker] missing: SolrUIMAConfiguration.MapField
        [smoker]
        [smoker] /x1/jenkins/jenkins-slave/workspace/Lucene-Solr-SmokeRelease-5.5/lucene/build/smokeTestRelease/tmp/unpack/solr-5.5.2/solr/build/docs/solr-clustering/org/apache/solr/handler/clustering/package-summary.html
        [smoker] missing: ClusteringParams
        [smoker] missing: DocumentClusteringEngine
        [smoker]
        [smoker] /x1/jenkins/jenkins-slave/workspace/Lucene-Solr-SmokeRelease-5.5/lucene/build/smokeTestRelease/tmp/unpack/solr-5.5.2/solr/build/docs/solr-solrj/org/apache/solr/common/package-summary.html
        [smoker] missing: Callable
        [smoker] missing: SolrDocumentBase
        [smoker] missing: SolrInputField
        [smoker] missing: StringUtils
        [smoker] missing: NonExistentCoreException
        [smoker] missing: SolrException
        [smoker]
        [smoker] /x1/jenkins/jenkins-slave/workspace/Lucene-Solr-SmokeRelease-5.5/lucene/build/smokeTestRelease/tmp/unpack/solr-5.5.2/solr/build/docs/solr-solrj/org/apache/solr/common/util/package-summary.html
        [smoker] missing: Cache
        [smoker] missing: ContentStream
        [smoker] missing: JavaBinCodec.WritableDocFields
        [smoker] missing: RetryUtil.BooleanRetryCmd
        [smoker] missing: RetryUtil.RetryCmd
        [smoker] missing: ByteUtils
        [smoker] missing: ExecutorUtil
        [smoker] missing: ExecutorUtil.MDCAwareThreadPoolExecutor
        [smoker] missing: IOUtils
        [smoker] missing: JavaBinCodec.StringBytes
        [smoker] missing: JavaBinCodec.StringCache
        [smoker] missing: ObjectReleaseTracker
        [smoker] missing: Pair
        [smoker] missing: RetryUtil
        [smoker] missing: SolrjNamedThreadFactory
        [smoker] missing: StrUtils
        [smoker] missing: URLUtil
        [smoker] missing: Utils
        [smoker] missing: XML
        [smoker] missing: XMLErrorLogger
        [smoker]
        [smoker] /x1/jenkins/jenkins-slave/workspace/Lucene-Solr-SmokeRelease-5.5/lucene/build/smokeTestRelease/tmp/unpack/solr-5.5.2/solr/build/docs/solr-solrj/org/apache/solr/common/luke/package-summary.html
        [smoker] missing: FieldFlag
        [smoker]
        [smoker] /x1/jenkins/jenkins-slave/workspace/Lucene-Solr-SmokeRelease-5.5/lucene/build/smokeTestRelease/tmp/unpack/solr-5.5.2/solr/build/docs/solr-solrj/org/apache/solr/common/cloud/package-summary.html
        [smoker] missing: BeforeReconnect
        [smoker] missing: ZkACLProvider
        [smoker] missing: ZkClientConnectionStrategy.ConnectedListener
        [smoker] missing: ZkClientConnectionStrategy.DisconnectedListener
        [smoker] missing: ZkCredentialsProvider
        [smoker] missing: Aliases
        [smoker] missing: ClusterState.CollectionRef
        [smoker] missing: ClusterStateUtil
        [smoker] missing: CompositeIdRouter
        [smoker] missing: ConnectionManager
        [smoker] missing: DefaultZkACLProvider
        [smoker] missing: DefaultZkCredentialsProvider
        [smoker] missing: DocRouter.Range
        [smoker] missing: HashBasedRouter
        [smoker] missing: PlainIdRouter
        [smoker] missing: Replica
        [smoker] missing: SolrZooKeeper
        [smoker] missing: VMParamsAllAndReadonlyDigestZkACLProvider
        [smoker] missing: VMParamsSingleSetCredentialsDigestZkCredentialsProvider
        [smoker] missing: ZkClientConnectionStrategy
        [smoker] missing: ZkClientConnectionStrategy.ZkUpdate
        [smoker] missing: ZkCmdExecutor
        [smoker] missing: ZkCoreNodeProps
        [smoker] missing: ZkCredentialsProvider.ZkCredentials
        [smoker] missing: ZkStateReader
        [smoker] missing: ZkStateReader.ConfigData
        [smoker] missing: ZooKeeperException
        [smoker]
        [smoker] /x1/jenkins/jenkins-slave/workspace/Lucene-Solr-SmokeRelease-5.5/lucene/build/smokeTestRelease/tmp/unpack/solr-5.5.2/solr/build/docs/solr-solrj/org/apache/solr/common/params/package-summary.html
        [smoker] missing: CollectionParams
        [smoker] missing: CommonAdminParams
        [smoker] missing: EventParams
        [smoker] missing: HighlightParams
        [smoker] missing: MoreLikeThisParams
        [smoker] missing: SpatialParams
        [smoker] missing: TermsParams
        [smoker] missing: TermVectorParams
        [smoker] missing: CollectionAdminParams
        [smoker] missing: CoreAdminParams
        [smoker] missing: DefaultSolrParams
        [smoker] missing: MapSolrParams
        [smoker] missing: MultiMapSolrParams
        [smoker] missing: CollectionParams.CollectionAction
        [smoker] missing: ConfigSetParams.ConfigSetAction
        [smoker] missing: CoreAdminParams.CoreAdminAction
        [smoker] missing: MoreLikeThisParams.TermStyle
        [smoker] missing: TermsParams.TermsRegexpFlag
        [smoker]
        [smoker] /x1/jenkins/jenkins-slave/workspace/Lucene-Solr-SmokeRelease-5.5/lucene/build/smokeTestRelease/tmp/unpack/solr-5.5.2/solr/build/docs/solr-solrj/org/apache/solr/client/solrj/package-summary.html
        [smoker] missing: ResponseParser
        [smoker] missing: SolrRequest
        [smoker] missing: SolrResponse
        [smoker] missing: SolrQuery.ORDER
        [smoker] missing: SolrRequest.METHOD
        [smoker]
        [smoker] /x1/jenkins/jenkins-slave/workspace/Lucene-Solr-SmokeRelease-5.5/lucene/build/smokeTestRelease/tmp/unpack/solr-5.5.2/solr/build/docs/solr-solrj/org/apache/solr/client/solrj/request/package-summary.html
        [smoker] missing: JavaBinUpdateRequestCodec.StreamingUpdateHandler
        [smoker] missing: AbstractUpdateRequest
        [smoker] missing: CollectionAdminRequest.AddReplica
        [smoker] missing: CollectionAdminRequest.AddReplicaProp
        [smoker] missing: CollectionAdminRequest.AddRole
        [smoker] missing: CollectionAdminRequest.AsyncCollectionAdminRequest
        [smoker] missing: CollectionAdminRequest.BalanceShardUnique
        [smoker] missing: CollectionAdminRequest.ClusterProp
        [smoker] missing: CollectionAdminRequest.ClusterStatus
        [smoker] missing: CollectionAdminRequest.CollectionAdminRoleRequest
        [smoker] missing: CollectionAdminRequest.CollectionShardAdminRequest
        [smoker] missing: CollectionAdminRequest.CollectionShardAsyncAdminRequest
        [smoker] missing: CollectionAdminRequest.CollectionSpecificAdminRequest
        [smoker] missing: CollectionAdminRequest.CollectionSpecificAsyncAdminRequest
        [smoker] missing: CollectionAdminRequest.CreateAlias
        [smoker] missing: CollectionAdminRequest.CreateShard
        [smoker] missing: CollectionAdminRequest.Delete
        [smoker] missing: CollectionAdminRequest.DeleteAlias
        [smoker] missing: CollectionAdminRequest.DeleteReplica
        [smoker] missing: CollectionAdminRequest.DeleteReplicaProp
        [smoker] missing: CollectionAdminRequest.DeleteShard
        [smoker] missing: CollectionAdminRequest.DeleteStatus
        [smoker] missing: CollectionAdminRequest.ForceLeader
        [smoker] missing: CollectionAdminRequest.List
        [smoker] missing: CollectionAdminRequest.Migrate
        [smoker] missing: CollectionAdminRequest.MigrateClusterState
        [smoker] missing: CollectionAdminRequest.OverseerStatus
        [smoker] missing: CollectionAdminRequest.Reload
        [smoker] missing: CollectionAdminRequest.RemoveRole
        [smoker] missing: CollectionAdminRequest.RequestStatus
        [smoker] missing: CollectionAdminRequest.SplitShard
        [smoker] missing: ConfigSetAdminRequest.ConfigSetSpecificAdminRequest
        [smoker] missing: ConfigSetAdminRequest.Create
        [smoker] missing: ConfigSetAdminRequest.Delete
        [smoker] missing: ConfigSetAdminRequest.List
        [smoker] missing: CoreAdminRequest.Create
        [smoker] missing: CoreAdminRequest.MergeIndexes
        [smoker] missing: CoreAdminRequest.OverrideLastPublished
        [smoker] missing: CoreAdminRequest.RequestRecovery
        [smoker] missing: CoreAdminRequest.RequestSyncShard
        [smoker] missing: CoreAdminRequest.Unload
        [smoker] missing: CoreAdminRequest.WaitForState
        [smoker] missing: GenericSolrRequest
        [smoker] missing: LukeRequest
        [smoker] missing: QueryRequest
        [smoker] missing: UpdateRequest
        [smoker] missing: AbstractUpdateRequest.ACTION
        [smoker]
        [smoker] /x1/jenkins/jenkins-slave/workspace/Lucene-Solr-SmokeRelease-5.5/lucene/build/smokeTestRelease/tmp/unpack/solr-5.5.2/solr/build/docs/solr-solrj/org/apache/solr/client/solrj/request/schema/package-summary.html
        [smoker] missing: AbstractSchemaRequest
        [smoker] missing: AnalyzerDefinition
        [smoker] missing: FieldTypeDefinition
        [smoker] missing: SchemaRequest.Update
        [smoker]
        [smoker] /x1/jenkins/jenkins-slave/workspace/Lucene-Solr-SmokeRelease-5.5/lucene/build/smokeTestRelease/tmp/unpack/solr-5.5.2/solr/build/docs/solr-solrj/org/apache/solr/client/solrj/impl/package-summary.html
        [smoker] missing: BinaryResponseParser
        [smoker] missing: CloudSolrClient.RouteResponse
        [smoker] missing: HttpClientUtil.HttpClientFactory
        [smoker] missing: HttpSolrClient.HttpUriRequestResponse
        [smoker] missing: LBHttpSolrClient.Req
        [smoker] missing: LBHttpSolrClient.Rsp
        [smoker] missing: LBHttpSolrClient.ServerWrapper
        [smoker] missing: SolrHttpRequestRetryHandler
        [smoker] missing: SolrPortAwareCookieSpecFactory
        [smoker] missing: SolrPortAwareCookieSpecFactory.PortAwareCookieSpec
        [smoker] missing: XMLResponseParser
        [smoker] missing: XMLResponseParser.KnownType
        [smoker] missing: CloudSolrClient.RouteException
        [smoker]
        [smoker] /x1/jenkins/jenkins-slave/workspace/Lucene-Solr-SmokeRelease-5.5/lucene/build/smokeTestRelease/tmp/unpack/solr-5.5.2/solr/build/docs/solr-solrj/org/apache/solr/client/solrj/util/package-summary.html
        [smoker] missing: ClientUtils
        [smoker]
        [smoker] /x1/jenkins/jenkins-slave/workspace/Lucene-Solr-SmokeRelease-5.5/lucene/build/smokeTestRelease/tmp/unpack/solr-5.5.2/solr/build/docs/solr-solrj/org/apache/solr/client/solrj/beans/package-summary.html
        [smoker] missing: BindingException
        [smoker]
        [smoker] /x1/jenkins/jenkins-slave/workspace/Lucene-Solr-SmokeRelease-5.5/lucene/build/smokeTestRelease/tmp/unpack/solr-5.5.2/solr/build/docs/solr-solrj/org/apache/solr/client/solrj/io/stream/package-summary.html
        [smoker] missing: JSONTupleStream
        [smoker] missing: TupleStream
        [smoker]
        [smoker] /x1/jenkins/jenkins-slave/workspace/Lucene-Solr-SmokeRelease-5.5/lucene/build/smokeTestRelease/tmp/unpack/solr-5.5.2/solr/build/docs/solr-solrj/org/apache/solr/client/solrj/response/package-summary.html
        [smoker] missing: CollectionAdminResponse
        [smoker] missing: ConfigSetAdminResponse.List
        [smoker] missing: CoreAdminResponse
        [smoker] missing: FacetField.Count
        [smoker] missing: LukeResponse.FieldInfo
        [smoker] missing: LukeResponse.FieldTypeInfo
        [smoker] missing: PivotField
        [smoker] missing: QueryResponse
        [smoker] missing: RangeFacet.Count
        [smoker] missing: RangeFacet.Date
        [smoker] missing: RangeFacet.Numeric
        [smoker] missing: SimpleSolrResponse
        [smoker] missing: SolrPingResponse
        [smoker] missing: SolrResponseBase
        [smoker] missing: SpellCheckResponse.Suggestion
        [smoker] missing: TermsResponse.Term
        [smoker]
        [smoker] /x1/jenkins/jenkins-slave/workspace/Lucene-Solr-SmokeRelease-5.5/lucene/build/smokeTestRelease/tmp/unpack/solr-5.5.2/solr/build/docs/solr-solrj/org/apache/solr/client/solrj/response/schema/package-summary.html
        [smoker] missing: FieldTypeRepresentation
        [smoker] missing: SchemaRepresentation
        [smoker] missing: SchemaResponse.CopyFieldsResponse
        [smoker] missing: SchemaResponse.DefaultQueryOperatorResponse
        [smoker] missing: SchemaResponse.DynamicFieldResponse
        [smoker] missing: SchemaResponse.DynamicFieldsResponse
        [smoker] missing: SchemaResponse.FieldResponse
        [smoker] missing: SchemaResponse.FieldsResponse
        [smoker] missing: SchemaResponse.FieldTypeResponse
        [smoker] missing: SchemaResponse.FieldTypesResponse
        [smoker] missing: SchemaResponse.GlobalSimilarityResponse
        [smoker] missing: SchemaResponse.SchemaNameResponse
        [smoker] missing: SchemaResponse.SchemaVersionResponse
        [smoker] missing: SchemaResponse.UniqueKeyResponse
        [smoker] missing: SchemaResponse.UpdateResponse
        [smoker]
        [smoker] /x1/jenkins/jenkins-slave/workspace/Lucene-Solr-SmokeRelease-5.5/lucene/build/smokeTestRelease/tmp/unpack/solr-5.5.2/solr/build/docs/solr-core/org/apache/solr/update/package-summary.html
        [smoker] missing: SolrCmdDistributor.AbortCheck
        [smoker] missing: SolrCoreState.IndexWriterCloser
        [smoker] missing: AddUpdateCommand
        [smoker] missing: CommitUpdateCommand
        [smoker] missing: DefaultSolrCoreState
        [smoker] missing: DeleteUpdateCommand
        [smoker] missing: DocumentBuilder
        [smoker] missing: HdfsUpdateLog
        [smoker] missing: IndexFingerprint
        [smoker] missing: MemOutputStream
        [smoker] missing: PeerSync
        [smoker] missing: RollbackUpdateCommand
        [smoker] missing: SolrCmdDistributor
        [smoker] missing: SolrCmdDistributor.Error
        [smoker] missing: SolrCmdDistributor.Node
        [smoker] missing: SolrCmdDistributor.Req
        [smoker] missing: SolrCmdDistributor.Response
        [smoker] missing: SolrCmdDistributor.RetryNode
        [smoker] missing: SolrCmdDistributor.StdNode
        [smoker] missing: SolrIndexSplitter
        [smoker] missing: StreamingSolrClients
        [smoker] missing: UpdateLog
        [smoker] missing: UpdateLog.LogPtr
        [smoker] missing: UpdateLog.RecoveryInfo
        [smoker] missing: UpdateShardHandler
        [smoker] missing: UpdateShardHandlerConfig
        [smoker] missing: VersionBucket
        [smoker] missing: VersionInfo
        [smoker] missing: UpdateLog.State
        [smoker] missing: UpdateLog.SyncLevel
        [smoker]
        [smoker] /x1/jenkins/jenkins-slave/workspace/Lucene-Solr-SmokeRelease-5.5/lucene/build/smokeTestRelease/tmp/unpack/solr-5.5.2/solr/build/docs/solr-core/org/apache/solr/update/processor/package-summary.html
        [smoker] missing: AtomicUpdateDocumentMerger
        [smoker] missing: DistributedUpdateProcessor
        [smoker] missing: FieldMutatingUpdateProcessorFactory.SelectorParams
        [smoker] missing: Lookup3Signature
        [smoker] missing: MD5Signature
        [smoker] missing: Signature
        [smoker] missing: SignatureUpdateProcessorFactory
        [smoker] missing: UpdateRequestProcessorChain.ProcessorInfo
        [smoker]
        [smoker] /x1/jenkins/jenkins-slave/workspace/Lucene-Solr-SmokeRelease-5.5/lucene/build/smokeTestRelease/tmp/unpack/solr-5.5.2/solr/build/docs/solr-core/org/apache/solr/servlet/package-summary.html
        [smoker] missing: SolrRequestParsers
        [smoker]
        [smoker] /x1/jenkins/jenkins-slave/workspace/Lucene-Solr-SmokeRelease-5.5/lucene/build/smokeTestRelease/tmp/unpack/solr-5.5.2/solr/build/docs/solr-core/org/apache/solr/servlet/cache/package-summary.html
        [smoker] missing: HttpCacheHeaderUtil
        [smoker] missing: Method
        [smoker]
        [smoker] /x1/jenkins/jenkins-slave/workspace/Lucene-Solr-SmokeRelease-5.5/lucene/build/smokeTestRelease/tmp/unpack/solr-5.5.2/solr/build/docs/solr-core/org/apache/solr/security/package-summary.html
        [smoker] missing: BasicAuthPlugin.AuthenticationProvider
        [smoker] missing: HttpClientInterceptorPlugin
        [smoker] missing: AuthenticationPlugin
        [smoker] missing: AuthorizationContext.CollectionRequest
        [smoker] missing: AuthorizationResponse
        [smoker] missing: BasicAuthPlugin
        [smoker] missing: KerberosFilter
        [smoker] missing: KerberosPlugin
        [smoker] missing: PKIAuthenticationPlugin
        [smoker] missing: PKIAuthenticationPlugin.PKIHeaderData
        [smoker] missing: RuleBasedAuthorizationPlugin
        [smoker] missing: SecurityPluginHolder
        [smoker] missing: Sha256AuthenticationProvider
        [smoker] missing: AuthorizationContext.RequestType
        [smoker]
        [smoker] /x1/jenkins/jenkins-slave/workspace/Lucene-Solr-SmokeRelease-5.5/lucene/build/smokeTestRelease/tmp/unpack/solr-5.5.2/solr/build/docs/solr-core/org/apache/solr/handler/package-summary.html
        [smoker] missing: BlobHandler
        [smoker] missing: DumpRequestHandler
        [smoker] missing: IndexFetcher.CompareResult
        [smoker] missing: MoreLikeThisHandler.InterestingTerm
        [smoker] missing: RealTimeGetHandler
        [smoker] missing: RequestHandlerBase
        [smoker] missing: RestoreCore
        [smoker] missing: SchemaHandler
        [smoker] missing: SolrConfigHandler
        [smoker] missing: StreamHandler
        [smoker] missing: PingRequestHandler.ACTIONS
        [smoker]
        [smoker] /x1/jenkins/jenkins-slave/workspace/Lucene-Solr-SmokeRelease-5.5/lucene/build/smokeTestRelease/tmp/unpack/solr-5.5.2/solr/build/docs/solr-core/org/apache/solr/handler/loader/package-summary.html
        [smoker] missing: CSVLoader
        [smoker] missing: JsonLoader
        [smoker] missing: XMLLoader
        [smoker]
        [smoker] /x1/jenkins/jenkins-slave/workspace/Lucene-Solr-SmokeRelease-5.5/lucene/build/smokeTestRelease/tmp/unpack/solr-5.5.2/solr/build/docs/solr-core/org/apache/solr/handler/admin/package-summary.html
        [smoker] missing: ClusterStatus
        [smoker] missing: CollectionsHandler
        [smoker] missing: CoreAdminHandler
        [smoker] missing: InfoHandler
        [smoker] missing: PluginInfoHandler
        [smoker] missing: PropertiesRequestHandler
        [smoker] missing: SecurityConfHandler
        [smoker] missing: ThreadDumpHandler
        [smoker]
        [smoker] /x1/jenkins/jenkins-slave/workspace/Lucene-Solr-SmokeRelease-5.5/lucene/build/smokeTestRelease/tmp/unpack/solr-5.5.2/solr/build/docs/solr-core/org/apache/solr/handler/component/package-summary.html
        [smoker] missing: HttpShardHandler
        [smoker] missing: HttpShardHandlerFactory
        [smoker] missing: PivotFacetHelper
        [smoker] missing: RealTimeGetComponent
        [smoker] missing: ResponseBuilder.GlobalCollectionStat
        [smoker] missing: ShardDoc
        [smoker] missing: ShardFieldSortedHitQueue
        [smoker] missing: ShardHandler
        [smoker] missing: ShardHandlerFactory
        [smoker] missing: ShardRequest
        [smoker] missing: ShardResponse
        [smoker] missing: SpellCheckMergeData
        [smoker]
        [smoker] /x1/jenkins/jenkins-slave/workspace/Lucene-Solr-SmokeRelease-5.5/lucene/build/smokeTestRelease/tmp/unpack/solr-5.5.2/solr/build/docs/solr-core/org/apache/solr/request/package-summary.html
        [smoker] missing: LocalSolrQueryRequest
        [smoker] missing: SimpleFacets.ParsedParams
        [smoker] missing: SolrRequestInfo
        [smoker]
        [smoker] /x1/jenkins/jenkins-slave/workspace/Lucene-Solr-SmokeRelease-5.5/lucene/build/smokeTestRelease/tmp/unpack/solr-5.5.2/solr/build/docs/solr-core/org/apache/solr/request/macro/package-summary.html
        [smoker] missing: MacroExpander
        [smoker]
        [smoker] /x1/jenkins/jenkins-slave/workspace/Lucene-Solr-SmokeRelease-5.5/lucene/build/smokeTestRelease/tmp/unpack/solr-5.5.2/solr/build/docs/solr-core/org/apache/solr/request/json/package-summary.html
        [smoker] missing: JSONUtil
        [smoker] missing: ObjectUtil
        [smoker] missing: ObjectUtil.ConflictHandler
        [smoker] missing: RequestUtil
        [smoker]
        [smoker] /x1/jenkins/jenkins-slave/workspace/Lucene-Solr-SmokeRelease-5.5/lucene/build/smokeTestRelease/tmp/unpack/solr-5.5.2/solr/build/docs/solr-core/org/apache/solr/store/hdfs/package-summary.html
        [smoker] missing: HdfsDirectory
        [smoker] missing: HdfsFileReader
        [smoker] missing: HdfsFileWriter
        [smoker] missing: HdfsLocalityReporter
        [smoker] missing: HdfsLockFactory
        [smoker]
        [smoker] /x1/jenkins/jenkins-slave/workspace/Lucene-Solr-SmokeRelease-5.5/lucene/build/smokeTestRelease/tmp/unpack/solr-5.5.2/solr/build/docs/solr-core/org/apache/solr/store/blockcache/package-summary.html
        [smoker] missing: Cache
        [smoker] missing: Store
        [smoker] missing: BlockCache
        [smoker] missing: BlockCacheKey
        [smoker] missing: BlockCacheLocation
        [smoker] missing: BlockDirectory
        [smoker] missing: BlockDirectoryCache
        [smoker] missing: BlockLocks
        [smoker] missing: BufferStore
        [smoker] missing: CustomBufferedIndexInput
        [smoker] missing: Metrics.MethodCall
        [smoker] missing: ReusedBufferedIndexOutput
        [smoker]
        [smoker] /x1/jenkins/jenkins-slave/workspace/Lucene-Solr-SmokeRelease-5.5/lucene/build/smokeTestRelease/tmp/unpack/solr-5.5.2/solr/build/docs/solr-core/org/apache/solr/spelling/package-summary.html
        [smoker] missing: ResultEntry
        [smoker] missing: SpellCheckCollation
        [smoker] missing: SpellCheckCollator
        [smoker] missing: SpellCheckCorrection
        [smoker] missing: SpellingOptions
        [smoker]
        [smoker] /x1/jenkins/jenkins-slave/workspace/Lucene-Solr-SmokeRelease-5.5/lucene/build/smokeTestRelease/tmp/unpack/solr-5.5.2/solr/build/docs/solr-core/org/apache/solr/spelling/suggest/package-summary.html
        [smoker] missing: SuggesterParams
        [smoker] missing: Suggester
        [smoker]
        [smoker] /x1/jenkins/jenkins-slave/workspace/Lucene-Solr-SmokeRelease-5.5/lucene/build/smokeTestRelease/tmp/unpack/solr-5.5.2/solr/build/docs/solr-core/org/apache/solr/schema/package-summary.html
        [smoker] missing: AbstractSpatialPrefixTreeFieldType
        [smoker] missing: BBoxField
        [smoker] missing: BinaryField
        [smoker] missing: BoolField
        [smoker] missing: ClassicIndexSchemaFactory
        [smoker] missing: FieldProperties
        [smoker] missing: FieldTypePluginLoader
        [smoker] missing: IndexSchema.DynamicCopy
        [smoker] missing: IndexSchema.DynamicField
        [smoker] missing: IndexSchema.DynamicReplacement
        [smoker] missing: IndexSchema.DynamicReplacement.DynamicPattern
        [smoker] missing: JsonPreAnalyzedParser
        [smoker] missing: SpatialPointVectorFieldType
        [smoker] missing: SpatialRecursivePrefixTreeFieldType
        [smoker] missing: SpatialTermQueryPrefixTreeFieldType
        [smoker] missing: StrField
        [smoker] missing: StrFieldSource
        [smoker] missing: SchemaManager.OpType
        [smoker] missing: TrieField.TrieTypes
        [smoker]
        [smoker] /x1/jenkins/jenkins-slave/workspace/Lucene-Solr-SmokeRelease-5.5/lucene/build/smokeTestRelease/tmp/unpack/solr-5.5.2/solr/build/docs/solr-core/org/apache/solr/core/package-summary.html
        [smoker] missing: CachingDirectoryFactory.CloseListener
        [smoker] missing: Diagnostics.Callable
        [smoker] missing: MapSerializable
        [smoker] missing: SolrCore.RawWriter
        [smoker] missing: SolrEventListener
        [smoker] missing: AbstractSolrEventListener
        [smoker] missing: CloudConfig
        [smoker] missing: CloudConfig.CloudConfigBuilder
        [smoker] missing: Config
        [smoker] missing: ConfigSetProperties
        [smoker] missing: CoreContainer
        [smoker] missing: CoreContainer.CoreLoadFailure
        [smoker] missing: Diagnostics
        [smoker] missing: HdfsDirectoryFactory
        [smoker] missing: ImplicitPlugins
        [smoker] missing: JarRepository.JarContent
        [smoker] missing: JarRepository.JarContentRef
        [smoker] missing: MemClassLoader
        [smoker] missing: NodeConfig
        [smoker] missing: NodeConfig.NodeConfigBuilder
        [smoker] missing: QuerySenderListener
        [smoker] missing: RequestHandlers
        [smoker] missing: RequestParams.VersionedParams
        [smoker] missing: SolrConfig.HttpCachingConfig
        [smoker] missing: SolrConfig.JmxConfiguration
        [smoker] missing: SolrConfig.SolrPluginInfo
        [smoker] missing: SolrConfig.UpdateHandlerInfo
        [smoker] missing: SolrCore
        [smoker] missing: SolrResourceLoader
        [smoker] missing: SolrXmlConfig
        [smoker] missing: ZkContainer
        [smoker] missing: DirectoryFactory.DirContext
        [smoker] missing: SolrConfig.HttpCachingConfig.LastModFrom
        [smoker] missing: SolrConfig.PluginOpts
        [smoker] missing: SolrInfoMBean.Category
        [smoker] missing: SolrResourceNotFoundException
        [smoker]
        [smoker] /x1/jenkins/jenkins-slave/workspace/Lucene-Solr-SmokeRelease-5.5/lucene/build/smokeTestRelease/tmp/unpack/solr-5.5.2/solr/build/docs/solr-core/org/apache/solr/query/package-summary.html
        [smoker] missing: FilterQuery
        [smoker]
        [smoker] /x1/jenkins/jenkins-slave/workspace/Lucene-Solr-SmokeRelease-5.5/lucene/build/smokeTestRelease/tmp/unpack/solr-5.5.2/solr/build/docs/solr-core/org/apache/solr/util/package-summary.html
        [smoker] missing: ConcurrentLFUCache.EvictionListener
        [smoker] missing: ConcurrentLRUCache.EvictionListener
        [smoker] missing: FSHDFSUtils.CallerInfo
        [smoker] missing: RTimer.TimerImpl
        [smoker] missing: AdjustableSemaphore
        [smoker] missing: CommandOperation
        [smoker] missing: ConcurrentLFUCache.CacheEntry
        [smoker] missing: ConcurrentLFUCache.Stats
        [smoker] missing: ConcurrentLRUCache.CacheEntry
        [smoker] missing: ConcurrentLRUCache.Stats
        [smoker] missing: CryptoKeys.RSAKeyPair
        [smoker] missing: DateFormatUtil
        [smoker] missing: DateFormatUtil.ThreadLocalDateFormat
        [smoker] missing: DefaultSolrThreadFactory
        [smoker] missing: DOMUtil
        [smoker] missing: FileUtils
        [smoker] missing: HdfsUtil
        [smoker] missing: NumberUtils
        [smoker] missing: PrimUtils.IntComparator
        [smoker] missing: PropertiesInputStream
        [smoker] missing: PropertiesOutputStream
        [smoker] missing: RecordingJSONParser
        [smoker] missing: SimplePostTool.BAOS
        [smoker] missing: SolrCLI.ConfigSetDownloadTool
        [smoker] missing: SolrCLI.ConfigSetUploadTool
        [smoker] missing: SolrCLI.CreateCoreTool
        [smoker] missing: SolrCLI.CreateTool
        [smoker] missing: SolrCLI.DeleteTool
        [smoker] missing: SolrCLI.ToolBase
        [smoker] missing: SolrLogLayout
        [smoker] missing: SolrLogLayout.CoreInfo
        [smoker] missing: SolrLogLayout.Method
        [smoker] missing: TimeOut
        [smoker] missing: VersionedFile
        [smoker] missing: TestInjection.TestShutdownFailError
        [smoker]
        [smoker] /x1/jenkins/jenkins-slave/workspace/Lucene-Solr-SmokeRelease-5.5/lucene/build/smokeTestRelease/tmp/unpack/solr-5.5.2/solr/build/docs/solr-core/org/apache/solr/util/plugin/package-summary.html
        [smoker] missing: SolrCoreAware
        [smoker] missing: MapPluginLoader
        [smoker] missing: NamedListPluginLoader
        [smoker]
        [smoker] /x1/jenkins/jenkins-slave/workspace/Lucene-Solr-SmokeRelease-5.5/lucene/build/smokeTestRelease/tmp/unpack/solr-5.5.2/solr/build/docs/solr-core/org/apache/solr/highlight/package-summary.html
        [smoker] missing: SolrEncoder
        [smoker] missing: SolrFormatter
        [smoker] missing: SolrFragListBuilder
        [smoker] missing: SolrFragmenter
        [smoker] missing: BreakIteratorBoundaryScanner
        [smoker] missing: DefaultSolrHighlighter
        [smoker] missing: GapFragmenter
        [smoker] missing: HighlightingPluginBase
        [smoker] missing: ScoreOrderFragmentsBuilder
        [smoker] missing: SimpleBoundaryScanner
        [smoker] missing: SimpleFragListBuilder
        [smoker] missing: SimpleFragmentsBuilder
        [smoker] missing: SingleFragListBuilder
        [smoker] missing: SolrBoundaryScanner
        [smoker] missing: SolrFragmentsBuilder
        [smoker] missing: SolrHighlighter
        [smoker] missing: WeightedFragListBuilder
        [smoker]
        [smoker] /x1/jenkins/jenkins-slave/workspace/Lucene-Solr-SmokeRelease-5.5/lucene/build/smokeTestRelease/tmp/unpack/solr-5.5.2/solr/build/docs/solr-core/org/apache/solr/parser/package-summary.html
        [smoker] missing: QueryParser
        [smoker]
        [smoker] /x1/jenkins/jenkins-slave/workspace/Lucene-Solr-SmokeRelease-5.5/lucene/build/smokeTestRelease/tmp/unpack/solr-5.5.2/solr/build/docs/solr-core/org/apache/solr/search/package-summary.html
        [smoker] missing: DocSetProducer
        [smoker] missing: ScoreFilter
        [smoker] missing: BitsFilteredPostingsEnum
        [smoker] missing: CollapsingQParserPlugin.CollapseScore
        [smoker] missing: CollapsingQParserPlugin.CollapsingPostFilter
        [smoker] missing: DocSetCollector
        [smoker] missing: DocSetUtil
        [smoker] missing: ExportQParserPlugin
        [smoker] missing: ExtendedDismaxQParser.Clause
        [smoker] missing: ExtendedQueryBase
        [smoker] missing: FunctionQParser
        [smoker] missing: FunctionRangeQuery
        [smoker] missing: JoinQParserPlugin
        [smoker] missing: LRUCache
        [smoker] missing: LuceneQParser
        [smoker] missing: MaxScoreQParser
        [smoker] missing: QParserPlugin
        [smoker] missing: QueryContext
        [smoker] missing: QueryUtils
        [smoker] missing: ReRankQParserPlugin
        [smoker] missing: SolrIndexSearcher.DocsEnumState
        [smoker] missing: SolrIndexSearcher.ProcessedFilter
        [smoker] missing: SortSpecParsing
        [smoker] missing: SpatialBoxQParserPlugin
        [smoker] missing: SpatialFilterQParser
        [smoker] missing: SpatialOptions
        [smoker] missing: XmlQParserPlugin
        [smoker] missing: CollapsingQParserPlugin.GroupHeadSelectorType
        [smoker] missing: Grouping.Format
        [smoker] missing: Grouping.TotalCount
        [smoker]
        [smoker] /x1/jenkins/jenkins-slave/workspace/Lucene-Solr-SmokeRelease-5.5/lucene/build/smokeTestRelease/tmp/unpack/solr-5.5.2/solr/build/docs/solr-core/org/apache/solr/search/facet/package-summary.html
        [smoker] missing: UnInvertedField.Callback
        [smoker] missing: AggValueSource
        [smoker] missing: AvgAgg
        [smoker] missing: BlockJoin
        [smoker] missing: CountAgg
        [smoker] missing: FacetDebugInfo
        [smoker] missing: FacetField
        [smoker] missing: FacetMerger
        [smoker] missing: FacetMerger.Context
        [smoker] missing: FacetModule
        [smoker] missing: FacetProcessor
        [smoker] missing: FacetQuery
        [smoker] missing: FacetRange
        [smoker] missing: FacetRequest
        [smoker] missing: FacetRequest.Domain
        [smoker] missing: FieldUtil
        [smoker] missing: HLLAgg
        [smoker] missing: HLLAgg.HLLFactory
        [smoker] missing: LegacyFacet
        [smoker] missing: LegacyFacet.Subfacet
        [smoker] missing: MaxAgg
        [smoker] missing: MinAgg
        [smoker] missing: PercentileAgg
        [smoker] missing: PercentileAgg.Parser
        [smoker] missing: SimpleAggValueSource
        [smoker] missing: SlotAcc
        [smoker] missing: SlotAcc.Resizer
        [smoker] missing: StrAggValueSource
        [smoker] missing: SumAgg
        [smoker] missing: SumAgg.Merger
        [smoker] missing: SumsqAgg
        [smoker] missing: UniqueAgg
        [smoker] missing: FacetField.FacetMethod
        [smoker] missing: FacetField.SortDirection
        [smoker]
        [smoker] /x1/jenkins/jenkins-slave/workspace/Lucene-Solr-SmokeRelease-5.5/lucene/build/smokeTestRelease/tmp/unpack/solr-5.5.2/solr/build/docs/solr-core/org/apache/solr/search/mlt/package-summary.html
        [smoker] missing: CloudMLTQParser
        [smoker] missing: SimpleMLTQParser
        [smoker]
        [smoker] /x1/jenkins/jenkins-slave/workspace/Lucene-Solr-SmokeRelease-5.5/lucene/build/smokeTestRelease/tmp/unpack/solr-5.5.2/solr/build/docs/solr-core/org/apache/solr/search/function/package-summary.html
        [smoker] missing: CollapseScoreFunction
        [smoker] missing: FileFloatSource.ReloadCacheRequestHandler
        [smoker]
        [smoker] /x1/jenkins/jenkins-slave/workspace/Lucene-Solr-SmokeRelease-5.5/lucene/build/smokeTestRelease/tmp/unpack/solr-5.5.2/solr/build/docs/solr-core/org/apache/solr/search/function/distance/package-summary.html
        [smoker] missing: StringDistanceFunction
        [smoker]
        [smoker] /x1/jenkins/jenkins-slave/workspace/Lucene-Solr-SmokeRelease-5.5/lucene/build/smokeTestRelease/tmp/unpack/solr-5.5.2/solr/build/docs/solr-core/org/apache/solr/search/join/package-summary.html
        [smoker] missing: BlockJoinChildQParser
        [smoker] missing: BlockJoinParentQParser
        [smoker]
        [smoker] /x1/jenkins/jenkins-slave/workspace/Lucene-Solr-SmokeRelease-5.5/lucene/build/smokeTestRelease/tmp/unpack/solr-5.5.2/solr/build/docs/solr-core/org/apache/solr/search/stats/package-summary.html
        [smoker] missing: CachedSearcherStats
        [smoker] missing: ExactSharedStatsCache
        [smoker] missing: ExactStatsCache.ExactStatsSource
        [smoker]
        [smoker] /x1/jenkins/jenkins-slave/workspace/Lucene-Solr-SmokeRelease-5.5/lucene/build/smokeTestRelease/tmp/unpack/solr-5.5.2/solr/build/docs/solr-core/org/apache/solr/search/grouping/package-summary.html
        [smoker] missing: CommandHandler.Builder
        [smoker]
        [smoker] /x1/jenkins/jenkins-slave/workspace/Lucene-Solr-SmokeRelease-5.5/lucene/build/smokeTestRelease/tmp/unpack/solr-5.5.2/solr/build/docs/solr-core/org/apache/solr/search/grouping/distributed/requestfactory/package-summary.html
        [smoker] missing: StoredFieldsShardRequestFactory
        [smoker]
        [smoker] /x1/jenkins/jenkins-slave/workspace/Lucene-Solr-SmokeRelease-5.5/lucene/build/smokeTestRelease/tmp/unpack/solr-5.5.2/solr/build/docs/solr-core/org/apache/solr/search/grouping/distributed/command/package-summary.html
        [smoker] missing: QueryCommand
        [smoker] missing: QueryCommand.Builder
        [smoker] missing: SearchGroupsFieldCommand.Builder
        [smoker] missing: TopGroupsFieldCommand.Builder
        [smoker]
        [smoker] /x1/jenkins/jenkins-slave/workspace/Lucene-Solr-SmokeRelease-5.5/lucene/build/smokeTestRelease/tmp/unpack/solr-5.5.2/solr/build/docs/solr-core/org/apache/solr/client/solrj/embedded/package-summary.html
        [smoker] missing: JettyConfig
        [smoker] missing: JettyConfig.Builder
        [smoker] missing: JettySolrRunner.DebugFilter
        [smoker] missing: SSLConfig
        [smoker]
        [smoker] /x1/jenkins/jenkins-slave/workspace/Lucene-Solr-SmokeRelease-5.5/lucene/build/smokeTestRelease/tmp/unpack/solr-5.5.2/solr/build/docs/solr-core/org/apache/solr/cloud/package-summary.html
        [smoker] missing: ActionThrottle.NanoTimeSource
        [smoker] missing: RecoveryStrategy.RecoveryListener
        [smoker] missing: ActionThrottle
        [smoker] missing: Assign
        [smoker] missing: CloudConfigSetService
        [smoker] missing: CloudDescriptor
        [smoker] missing: CloudUtil
        [smoker] missing: ElectionContext
        [smoker] missing: Overseer.FailedOp
        [smoker] missing: Overseer.Stat
        [smoker] missing: OverseerSolrResponse
        [smoker] missing: OverseerTaskQueue.QueueEvent
        [smoker] missing: RecoveryStrategy
        [smoker] missing: SolrZkServer
        [smoker] missing: SyncStrategy
        [smoker] missing: ZkCLI
        [smoker] missing: ZkSolrResourceLoader.ZkByteArrayInputStream
        [smoker] missing: OverseerMessageHandler.ExclusiveMarking
        [smoker] missing: ZkController.ResourceModifiedInZkException
        [smoker]
        [smoker] /x1/jenkins/jenkins-slave/workspace/Lucene-Solr-SmokeRelease-5.5/lucene/build/smokeTestRelease/tmp/unpack/solr-5.5.2/solr/build/docs/solr-core/org/apache/solr/cloud/rule/package-summary.html
        [smoker] missing: RemoteCallback
        [smoker] missing: ImplicitSnitch
        [smoker] missing: ReplicaAssigner
        [smoker] missing: ReplicaAssigner.Position
        [smoker] missing: Rule
        [smoker] missing: Rule.Condition
        [smoker] missing: Snitch
        [smoker] missing: SnitchContext.SnitchInfo
        [smoker] missing: Rule.Operand
        [smoker]
        [smoker] /x1/jenkins/jenkins-slave/workspace/Lucene-Solr-SmokeRelease-5.5/lucene/build/smokeTestRelease/tmp/unpack/solr-5.5.2/solr/build/docs/solr-core/org/apache/solr/cloud/overseer/package-summary.html
        [smoker] missing: ZkStateWriter.ZkWriteCallback
        [smoker] missing: ClusterStateMutator
        [smoker] missing: CollectionMutator
        [smoker] missing: NodeMutator
        [smoker] missing: ReplicaMutator
        [smoker] missing: SliceMutator
        [smoker] missing: ZkWriteCommand
        [smoker]
        [smoker] /x1/jenkins/jenkins-slave/workspace/Lucene-Solr-SmokeRelease-5.5/lucene/build/smokeTestRelease/tmp/unpack/solr-5.5.2/solr/build/docs/solr-core/org/apache/solr/index/package-summary.html
        [smoker] missing: MergePolicyFactoryArgs
        [smoker]
        [smoker] /x1/jenkins/jenkins-slave/workspace/Lucene-Solr-SmokeRelease-5.5/lucene/build/smokeTestRelease/tmp/unpack/solr-5.5.2/solr/build/docs/solr-core/org/apache/solr/index/hdfs/package-summary.html
        [smoker] missing: CheckHdfsIndex
        [smoker]
        [smoker] /x1/jenkins/jenkins-slave/workspace/Lucene-Solr-SmokeRelease-5.5/lucene/build/smokeTestRelease/tmp/unpack/solr-5.5.2/solr/build/docs/solr-core/org/apache/solr/analysis/package-summary.html
        [smoker] missing: SolrAnalyzer
        [smoker]
        [smoker] /x1/jenkins/jenkins-slave/workspace/Lucene-Solr-SmokeRelease-5.5/lucene/build/smokeTestRelease/tmp/unpack/solr-5.5.2/solr/build/docs/solr-core/org/apache/solr/logging/package-summary.html
        [smoker] missing: ListenerConfig
        [smoker]
        [smoker] /x1/jenkins/jenkins-slave/workspace/Lucene-Solr-SmokeRelease-5.5/lucene/build/smokeTestRelease/tmp/unpack/solr-5.5.2/solr/build/docs/solr-core/org/apache/solr/logging/jul/package-summary.html
        [smoker] missing: JulInfo
        [smoker] missing: JulWatcher
        [smoker] missing: RecordHandler
        [smoker]
        [smoker] /x1/jenkins/jenkins-slave/workspace/Lucene-Solr-SmokeRelease-5.5/lucene/build/smokeTestRelease/tmp/unpack/solr-5.5.2/solr/build/docs/solr-core/org/apache/solr/logging/log4j/package-summary.html
        [smoker] missing: EventAppender
        [smoker] missing: Log4jInfo
        [smoker] missing: Log4jWatcher
        [smoker]
        [smoker] /x1/jenkins/jenkins-slave/workspace/Lucene-Solr-SmokeRelease-5.5/lucene/build/smokeTestRelease/tmp/unpack/solr-5.5.2/solr/build/docs/solr-core/org/apache/solr/internal/csv/writer/package-summary.html
        [smoker] missing: CSVField
        [smoker]
        [smoker] /x1/jenkins/jenkins-slave/workspace/Lucene-Solr-SmokeRelease-5.5/lucene/build/smokeTestRelease/tmp/unpack/solr-5.5.2/solr/build/docs/solr-core/org/apache/solr/response/package-summary.html
        [smoker] missing: SortingResponseWriter.IntComp
        [smoker] missing: SortingResponseWriter.SortValue
        [smoker] missing: BinaryResponseWriter
        [smoker] missing: BinaryResponseWriter.Resolver
        [smoker] missing: CSVResponseWriter
        [smoker] missing: JSONResponseWriter
        [smoker] missing: PHPResponseWriter
        [smoker] missing: PythonResponseWriter
        [smoker] missing: RubyResponseWriter
        [smoker] missing: SchemaXmlResponseWriter
        [smoker] missing: SchemaXmlWriter
        [smoker] missing: SmileResponseWriter
        [smoker] missing: SmileResponseWriter.SmileWriter
        [smoker] missing: SortingResponseWriter
        [smoker] missing: WriteableValue
        [smoker] missing: XMLResponseWriter
        [smoker] missing: XMLWriter
        [smoker] missing: SortingResponseWriter.IgnoreException
        [smoker]
        [smoker] /x1/jenkins/jenkins-slave/workspace/Lucene-Solr-SmokeRelease-5.5/lucene/build/smokeTestRelease/tmp/unpack/solr-5.5.2/solr/build/docs/solr-core/org/apache/solr/response/transform/package-summary.html
        [smoker] missing: BaseEditorialTransformer
        [smoker] missing: ChildDocTransformerFactory
        [smoker] missing: DocIdAugmenterFactory
        [smoker] missing: ExcludedMarkerFactory
        [smoker] missing: ExplainAugmenterFactory
        [smoker] missing: RawValueTransformerFactory
        [smoker] missing: RawValueTransformerFactory.WriteableStringValue
        [smoker] missing: ShardAugmenterFactory
        [smoker] missing: ValueAugmenterFactory
        [smoker] missing: ExplainAugmenterFactory.Style
        [smoker]
        [smoker] /x1/jenkins/jenkins-slave/workspace/Lucene-Solr-SmokeRelease-5.5/lucene/build/smokeTestRelease/tmp/unpack/solr-5.5.2/solr/build/docs/solr-velocity/org/apache/solr/response/package-summary.html
        [smoker] missing: SolrParamResourceLoader
        [smoker] missing: SolrVelocityLogger
        [smoker] missing: VelocityResponseWriter
        [smoker]
        [smoker] /x1/jenkins/jenkins-slave/workspace/Lucene-Solr-SmokeRelease-5.5/lucene/build/smokeTestRelease/tmp/unpack/solr-5.5.2/solr/build/docs/solr-dataimporthandler/org/apache/solr/handler/dataimport/package-summary.html
        [smoker] missing: DIHWriter
        [smoker] missing: CachePropertyUtil
        [smoker] missing: ConfigParseUtil
        [smoker] missing: DebugInfo
        [smoker] missing: DIHCacheSupport
        [smoker] missing: DIHWriterBase
        [smoker] missing: DocBuilder.Statistics
        [smoker] missing: Evaluator.VariableWrapper
        [smoker] missing: RequestInfo
        [smoker] missing: SolrQueryEscapingEvaluator
        [smoker] missing: SortedMapBackedCache
        [smoker] missing: DataImporter.Status
        [smoker] missing: DIHLogLevels
        [smoker]
        [smoker] /x1/jenkins/jenkins-slave/workspace/Lucene-Solr-SmokeRelease-5.5/lucene/build/smokeTestRelease/tmp/unpack/solr-5.5.2/solr/build/docs/solr-dataimporthandler/org/apache/solr/handler/dataimport/config/package-summary.html
        [smoker] missing: ConfigNameConstants
        [smoker] missing: ConfigParseUtil
        [smoker] missing: Entity
        [smoker] missing: EntityField
        [smoker] missing: EntityField.Builder
        [smoker] missing: Field
        [smoker] missing: Field.Builder
        [smoker] missing: PropertyWriter
        [smoker] missing: Script
        [smoker]
        [smoker] /x1/jenkins/jenkins-slave/workspace/Lucene-Solr-SmokeRelease-5.5/lucene/build/smokeTestRelease/tmp/unpack/solr-5.5.2/solr/build/docs/solr-dataimporthandler-extras/org/apache/solr/handler/dataimport/package-summary.html
        [smoker] missing: MailEntityProcessor.CustomFilter
        [smoker]
        [smoker] /x1/jenkins/jenkins-slave/workspace/Lucene-Solr-SmokeRelease-5.5/lucene/build/smokeTestRelease/tmp/unpack/solr-5.5.2/solr/build/docs/solr-map-reduce/org/apache/solr/hadoop/package-summary.html
        [smoker] missing: SolrInputDocumentWritable
        [smoker] missing: SolrMapper
        [smoker] missing: SolrOutputFormat
        [smoker] missing: UnbufferedDataInputInputStream
        [smoker] missing: Utils
        [smoker] missing: SolrCounters
        [smoker]
        [smoker] /x1/jenkins/jenkins-slave/workspace/Lucene-Solr-SmokeRelease-5.5/lucene/build/smokeTestRelease/tmp/unpack/solr-5.5.2/solr/build/docs/solr-map-reduce/org/apache/solr/hadoop/dedup/package-summary.html
        [smoker] missing: SolrInputDocumentComparator.TimeStampComparator
        [smoker]
        [smoker] /x1/jenkins/jenkins-slave/workspace/Lucene-Solr-SmokeRelease-5.5/lucene/build/smokeTestRelease/tmp/unpack/solr-5.5.2/solr/build/docs/solr-map-reduce/org/apache/solr/hadoop/morphline/package-summary.html
        [smoker] missing: MorphlineCounters
        [smoker]
        [smoker] /x1/jenkins/jenkins-slave/workspace/Lucene-Solr-SmokeRelease-5.5/lucene/build/smokeTestRelease/tmp/unpack/solr-5.5.2/solr/build/docs/solr-langid/org/apache/solr/update/processor/package-summary.html
        [smoker] missing: LangIdParams
        [smoker]
        [smoker] /x1/jenkins/jenkins-slave/workspace/Lucene-Solr-SmokeRelease-5.5/lucene/build/smokeTestRelease/tmp/unpack/solr-5.5.2/solr/build/docs/solr-cell/org/apache/solr/handler/extraction/package-summary.html
        [smoker] missing: ExtractingDocumentLoader.MostlyPassthroughHtmlMapper
        [smoker] missing: ParseContextConfig
        [smoker] missing: SolrContentHandlerFactory
        [smoker]
        [smoker] /x1/jenkins/jenkins-slave/workspace/Lucene-Solr-SmokeRelease-5.5/lucene/build/smokeTestRelease/tmp/unpack/solr-5.5.2/solr/build/docs/solr-analytics/org/apache/solr/handler/component/package-summary.html
        [smoker] missing: AnalyticsComponent
        [smoker]
        [smoker] /x1/jenkins/jenkins-slave/workspace/Lucene-Solr-SmokeRelease-5.5/lucene/build/smokeTestRelease/tmp/unpack/solr-5.5.2/solr/build/docs/solr-analytics/org/apache/solr/analytics/request/package-summary.html
        [smoker] missing: FacetRequest
        [smoker] missing: FieldFacetRequest.FacetSortDirection
        [smoker]
        [smoker] /x1/jenkins/jenkins-slave/workspace/Lucene-Solr-SmokeRelease-5.5/lucene/build/smokeTestRelease/tmp/unpack/solr-5.5.2/solr/build/docs/solr-analytics/org/apache/solr/analytics/plugin/package-summary.html
        [smoker] missing: AnalyticsStatisticsCollector
        [smoker]
        [smoker] /x1/jenkins/jenkins-slave/workspace/Lucene-Solr-SmokeRelease-5.5/lucene/build/smokeTestRelease/tmp/unpack/solr-5.5.2/solr/build/docs/solr-analytics/org/apache/solr/analytics/util/package-summary.html
        [smoker] missing: AnalyticsParams
        [smoker] missing: MedianCalculator
        [smoker] missing: PercentileCalculator
        [smoker] missing: RangeEndpointCalculator
        [smoker] missing: RangeEndpointCalculator.DateRangeEndpointCalculator
        [smoker] missing: RangeEndpointCalculator.DoubleRangeEndpointCalculator
        [smoker] missing: RangeEndpointCalculator.FacetRange
        [smoker] missing: RangeEndpointCalculator.FloatRangeEndpointCalculator
        [smoker] missing: RangeEndpointCalculator.IntegerRangeEndpointCalculator
        [smoker] missing: RangeEndpointCalculator.LongRangeEndpointCalculator
        [smoker]
        [smoker] /x1/jenkins/jenkins-slave/workspace/Lucene-Solr-SmokeRelease-5.5/lucene/build/smokeTestRelease/tmp/unpack/solr-5.5.2/solr/build/docs/solr-analytics/org/apache/solr/analytics/expression/package-summary.html
        [smoker] missing: ExpressionFactory
        [smoker]
        [smoker] /x1/jenkins/jenkins-slave/workspace/Lucene-Solr-SmokeRelease-5.5/lucene/build/smokeTestRelease/tmp/unpack/solr-5.5.2/solr/build/docs/solr-analytics/org/apache/solr/analytics/statistics/package-summary.html
        [smoker] missing: StatsCollectorSupplierFactory
        [smoker]
        [smoker] /x1/jenkins/jenkins-slave/workspace/Lucene-Solr-SmokeRelease-5.5/lucene/build/smokeTestRelease/tmp/unpack/solr-5.5.2/solr/build/docs/solr-test-framework/org/apache/solr/package-summary.html
        [smoker] missing: BaseDistributedSearchTestCase.RandDate
        [smoker] missing: BaseDistributedSearchTestCase.RandVal
        [smoker] missing: JSONTestUtil
        [smoker] missing: SolrJettyTestBase
        [smoker] missing: SolrTestCaseHS
        [smoker] missing: SolrTestCaseHS.Client
        [smoker] missing: SolrTestCaseHS.Client.Tester
        [smoker] missing: SolrTestCaseHS.ClientProvider
        [smoker] missing: SolrTestCaseHS.SolrInstance
        [smoker] missing: SolrTestCaseHS.SolrInstances
        [smoker] missing: SolrTestCaseJ4.Doc
        [smoker] missing: SolrTestCaseJ4.Fld
        [smoker] missing: SolrTestCaseJ4.FVal
        [smoker] missing: SolrTestCaseJ4.IRange
        [smoker] missing: SolrTestCaseJ4.IVals
        [smoker] missing: SolrTestCaseJ4.IValsPercent
        [smoker] missing: SolrTestCaseJ4.SVal
        [smoker] missing: SolrTestCaseJ4.Vals
        [smoker] missing: BaseDistributedSearchTestCase.ShardsFixed
        [smoker] missing: BaseDistributedSearchTestCase.ShardsRepeat
        [smoker]
        [smoker] /x1/jenkins/jenkins-slave/workspace/Lucene-Solr-SmokeRelease-5.5/lucene/build/smokeTestRelease/tmp/unpack/solr-5.5.2/solr/build/docs/solr-test-framework/org/apache/solr/update/processor/package-summary.html
        [smoker] missing: BufferingRequestProcessor
        [smoker]
        [smoker] /x1/jenkins/jenkins-slave/workspace/Lucene-Solr-SmokeRelease-5.5/lucene/build/smokeTestRelease/tmp/unpack/solr-5.5.2/solr/build/docs/solr-test-framework/org/apache/solr/handler/component/package-summary.html
        [smoker] missing: TrackingShardHandlerFactory.ShardRequestAndParams
        [smoker]
        [smoker] /x1/jenkins/jenkins-slave/workspace/Lucene-Solr-SmokeRelease-5.5/lucene/build/smokeTestRelease/tmp/unpack/solr-5.5.2/solr/build/docs/solr-test-framework/org/apache/solr/core/package-summary.html
        [smoker] missing: AbstractBadConfigTestBase
        [smoker]
        [smoker] /x1/jenkins/jenkins-slave/workspace/Lucene-Solr-SmokeRelease-5.5/lucene/build/smokeTestRelease/tmp/unpack/solr-5.5.2/solr/build/docs/solr-test-framework/org/apache/solr/util/package-summary.html
        [smoker] missing: RESTfulServerProvider
        [smoker] missing: BadHdfsThreadsFilter
        [smoker] missing: BadMrClusterThreadsFilter
        [smoker] missing: BadZookeeperThreadsFilter
        [smoker] missing: BaseTestHarness
        [smoker] missing: DOMUtilTestBase
        [smoker] missing: ReadOnlyCoresLocator
        [smoker] missing: RestTestBase
        [smoker] missing: RevertDefaultThreadHandlerRule
        [smoker] missing: SSLTestConfig
        [smoker] missing: TestHarness.TestCoresLocator
        [smoker]
        [smoker] /x1/jenkins/jenkins-slave/workspace/Lucene-Solr-SmokeRelease-5.5/lucene/build/smokeTestRelease/tmp/unpack/solr-5.5.2/solr/build/docs/solr-test-framework/org/apache/solr/cloud/package-summary.html
        [smoker] missing: AbstractDistribZkTestBase
        [smoker] missing: AbstractFullDistribZkTestBase.CloudJettyRunner
        [smoker] missing: CloudInspectUtil
        [smoker] missing: MockSolrZkClient
        [smoker] missing: MockZkStateReader
        [smoker] missing: StoppableIndexingThread
        [smoker] missing: ZkTestServer
        [smoker] missing: ZkTestServer.HostPort
        [smoker] missing: ZkTestServer.LimitViolationAction
        [smoker]
        [smoker] ***WARNING***: javadocs want to fail!
        [smoker]
        [smoker]
        [smoker] Crawl/parse...
        [smoker]
        [smoker] Verify...
        [smoker] test solr example w/ Java 7...
        [smoker] start Solr instance (log=/x1/jenkins/jenkins-slave/workspace/Lucene-Solr-SmokeRelease-5.5/lucene/build/smokeTestRelease/tmp/unpack/solr-5.5.2/solr-example.log)...
        [smoker] No process found for Solr node running on port 8983
        [smoker] Running techproducts example on port 8983 from /x1/jenkins/jenkins-slave/workspace/Lucene-Solr-SmokeRelease-5.5/lucene/build/smokeTestRelease/tmp/unpack/solr-5.5.2
        [smoker] Creating Solr home directory /x1/jenkins/jenkins-slave/workspace/Lucene-Solr-SmokeRelease-5.5/lucene/build/smokeTestRelease/tmp/unpack/solr-5.5.2/solr/example/techproducts/solr
        [smoker]
        [smoker] Starting up Solr on port 8983 using command:
        [smoker] bin/solr start -p 8983 -s "example/techproducts/solr"
        [smoker]
        [smoker] Waiting up to 30 seconds to see Solr running on port 8983 [|]  [/]  [-]  [\]  [|]  [/]  [-]  [\]  [|]  [/]  [-]
        [smoker] Started Solr server on port 8983 (pid=30939). Happy searching!
        [smoker]
        [smoker]  
        [smoker] Copying configuration to new core instance directory:
        [smoker] /x1/jenkins/jenkins-slave/workspace/Lucene-Solr-SmokeRelease-5.5/lucene/build/smokeTestRelease/tmp/unpack/solr-5.5.2/solr/example/techproducts/solr/techproducts
        [smoker]
        [smoker] Creating new core 'techproducts' using command:
        [smoker] http://localhost:8983/solr/admin/cores?action=CREATE&name=techproducts&instanceDir=techproducts
        [smoker]
        [smoker] {
        [smoker] "responseHeader":{
        [smoker] "status":0,
        [smoker] "QTime":1772},
        [smoker] "core":"techproducts"}
        [smoker]
        [smoker]
        [smoker] Indexing tech product example docs from /x1/jenkins/jenkins-slave/workspace/Lucene-Solr-SmokeRelease-5.5/lucene/build/smokeTestRelease/tmp/unpack/solr-5.5.2/solr/example/exampledocs
        [smoker] SimplePostTool version 5.0.0
        [smoker] Posting files to [base] url http://localhost:8983/solr/techproducts/update using content-type application/xml...
        [smoker] POSTing file money.xml to [base]
        [smoker] POSTing file mem.xml to [base]
        [smoker] POSTing file vidcard.xml to [base]
        [smoker] POSTing file ipod_video.xml to [base]
        [smoker] POSTing file sd500.xml to [base]
        [smoker] POSTing file gb18030-example.xml to [base]
        [smoker] POSTing file mp500.xml to [base]
        [smoker] POSTing file monitor2.xml to [base]
        [smoker] POSTing file utf8-example.xml to [base]
        [smoker] POSTing file manufacturers.xml to [base]
        [smoker] POSTing file hd.xml to [base]
        [smoker] POSTing file solr.xml to [base]
        [smoker] POSTing file monitor.xml to [base]
        [smoker] POSTing file ipod_other.xml to [base]
        [smoker] 14 files indexed.
        [smoker] COMMITting Solr index changes to http://localhost:8983/solr/techproducts/update...
        [smoker] Time spent: 0:00:00.355
        [smoker]
        [smoker] Solr techproducts example launched successfully. Direct your Web browser to http://localhost:8983/solr to visit the Solr Admin UI
        [smoker] test utf8...
        [smoker] run query...
        [smoker] stop server using: bin/solr stop -p 8983
        [smoker] Sending stop command to Solr running on port 8983 ... waiting 5 seconds to allow Jetty process 30939 to stop gracefully.
        [smoker] [|]  [/]  [-]  [\]  [|]  [/]  [-]  [\]  [|]  [/]   run tests w/ Java 8 and testArgs='-Dtests.slow=false'...
        [smoker]
        [smoker] command "export JAVA_HOME="/home/jenkins/jenkins-slave/tools/hudson.model.JDK/latest1.8" PATH="/home/jenkins/jenkins-slave/tools/hudson.model.JDK/latest1.8/bin:$PATH" JAVACMD="/home/jenkins/jenkins-slave/tools/hudson.model.JDK/latest1.8/bin/java"; ant clean test -Dtests.slow=false -Dtests.slow=false" failed:
        [smoker] Buildfile: /x1/jenkins/jenkins-slave/workspace/Lucene-Solr-SmokeRelease-5.5/lucene/build/smokeTestRelease/tmp/unpack/solr-5.5.2/solr/build.xml
        [smoker]
        [smoker] clean:
        [smoker] [delete] Deleting directory /x1/jenkins/jenkins-slave/workspace/Lucene-Solr-SmokeRelease-5.5/lucene/build/smokeTestRelease/tmp/unpack/solr-5.5.2/solr/build
        [smoker] [delete] Deleting directory /x1/jenkins/jenkins-slave/workspace/Lucene-Solr-SmokeRelease-5.5/lucene/build/smokeTestRelease/tmp/unpack/solr-5.5.2/solr/dist
        [smoker] [delete] Deleting directory /x1/jenkins/jenkins-slave/workspace/Lucene-Solr-SmokeRelease-5.5/lucene/build/smokeTestRelease/tmp/unpack/solr-5.5.2/solr/package
        [smoker] [delete] Deleting directory /x1/jenkins/jenkins-slave/workspace/Lucene-Solr-SmokeRelease-5.5/lucene/build/smokeTestRelease/tmp/unpack/solr-5.5.2/solr/example/techproducts
        [smoker]
        [smoker] ivy-availability-check:
        [smoker]
        [smoker] ivy-fail:
        [smoker]
        [smoker] ivy-configure:
        [smoker] [ivy:configure] :: Apache Ivy 2.3.0 - 20130110142753 :: http://ant.apache.org/ivy/ ::
        [smoker] [ivy:configure] :: loading settings :: file = /x1/jenkins/jenkins-slave/workspace/Lucene-Solr-SmokeRelease-5.5/lucene/build/smokeTestRelease/tmp/unpack/solr-5.5.2/lucene/ivy-settings.xml
        [smoker]
        [smoker] resolve-groovy:
        [smoker] [ivy:cachepath] :: resolving dependencies :: org.codehaus.groovy#groovy-all-caller;working
        [smoker] [ivy:cachepath] confs: [default]
        [smoker] [ivy:cachepath] found org.codehaus.groovy#groovy-all;2.4.4 in public
        [smoker] [ivy:cachepath] :: resolution report :: resolve 204ms :: artifacts dl 2ms
        [smoker] ---------------------------------------------------------------------
        [smoker] | | modules || artifacts |
        [smoker] | conf | number| search|dwnlded|evicted|| number|dwnlded|
        [smoker] ---------------------------------------------------------------------
        [smoker] | default | 1 | 0 | 0 | 0 || 1 | 0 |
        [smoker] ---------------------------------------------------------------------
        [smoker]
        [smoker] -init-totals:
        [smoker] [mkdir] Created dir: /x1/jenkins/jenkins-slave/workspace/Lucene-Solr-SmokeRelease-5.5/lucene/build/smokeTestRelease/tmp/unpack/solr-5.5.2/solr/build/solr
        [smoker]
        [smoker] -clover.load:
        [smoker]
        [smoker] test-solr-core:
        [smoker]
        [smoker] test:
        [smoker]
        [smoker] -clover.disable:
        [smoker]
        [smoker] ivy-availability-check:
        [smoker]
        [smoker] ivy-fail:
        [smoker]
        [smoker] ivy-configure:
        [smoker] [ivy:configure] :: loading settings :: file = /x1/jenkins/jenkins-slave/workspace/Lucene-Solr-SmokeRelease-5.5/lucene/build/smokeTestRelease/tmp/unpack/solr-5.5.2/lucene/ivy-settings.xml
        [smoker]
        [smoker] -clover.load:
        [smoker]
        [smoker] -clover.classpath:
        [smoker]
        [smoker] -clover.setup:
        [smoker]
        [smoker] clover:
        [smoker]
        [smoker] check-analyzers-icu-uptodate:
        [smoker]
        [smoker] jar-analyzers-icu:
        [smoker]
        [smoker] -compile-test-lucene-queryparser:
        [smoker]
        [smoker] -check-git-state:
        [smoker]
        [smoker] -git-cleanroot:
        [smoker]
        [smoker] -copy-git-state:
        [smoker]
        [smoker] git-autoclean:
        [smoker]
        [smoker] ivy-availability-check:
        [smoker]
        [smoker] ivy-fail:
        [smoker]
        [smoker] ivy-configure:
        [smoker] [ivy:configure] :: loading settings :: file = /x1/jenkins/jenkins-slave/workspace/Lucene-Solr-SmokeRelease-5.5/lucene/build/smokeTestRelease/tmp/unpack/solr-5.5.2/lucene/ivy-settings.xml
        [smoker]
        [smoker] resolve:
        [smoker]
        [smoker] common.init:
        [smoker]
        [smoker] compile-lucene-core:
        [smoker]
        [smoker] -check-git-state:
        [smoker]
        [smoker] -git-cleanroot:
        [smoker]
        [smoker] -copy-git-state:
        [smoker]
        [smoker] git-autoclean:
        [smoker]
        [smoker] ivy-availability-check:
        [smoker]
        [smoker] ivy-fail:
        [smoker]
        [smoker] ivy-configure:
        [smoker] [ivy:configure] :: loading settings :: file = /x1/jenkins/jenkins-slave/workspace/Lucene-Solr-SmokeRelease-5.5/lucene/build/smokeTestRelease/tmp/unpack/solr-5.5.2/lucene/ivy-settings.xml
        [smoker]
        [smoker] resolve:
        [smoker]
        [smoker] init:
        [smoker]
        [smoker] -clover.disable:
        [smoker]
        [smoker] -clover.load:
        [smoker]
        [smoker] -clover.classpath:
        [smoker]
        [smoker] -clover.setup:
        [smoker]
        [smoker] clover:
        [smoker]
        [smoker] compile-core:
        [smoker]
        [smoker] init:
        [smoker]
        [smoker] compile-test:
        [smoker]
        [smoker] check-queries-uptodate:
        [smoker]
        [smoker] jar-queries:
        [smoker]
        [smoker] check-sandbox-uptodate:
        [smoker]
        [smoker] jar-sandbox:
        [smoker]
        [smoker] -check-git-state:
        [smoker]
        [smoker] -git-cleanroot:
        [smoker]
        [smoker] -copy-git-state:
        [smoker]
        [smoker] git-autoclean:
        [smoker]
        [smoker] ivy-availability-check:
        [smoker]
        [smoker] ivy-configure:
        [smoker] [ivy:configure] :: loading settings :: file = /x1/jenkins/jenkins-slave/workspace/Lucene-Solr-SmokeRelease-5.5/lucene/build/smokeTestRelease/tmp/unpack/solr-5.5.2/lucene/ivy-settings.xml
        [smoker]
        [smoker] resolve:
        [smoker]
        [smoker] common.init:
        [smoker]
        [smoker] compile-lucene-core:
        [smoker]
        [smoker] init:
        [smoker]
        [smoker] -clover.disable:
        [smoker]
        [smoker] -clover.load:
        [smoker]
        [smoker] -clover.classpath:
        [smoker]
        [smoker] -clover.setup:
        [smoker]
        [smoker] clover:
        [smoker]
        [smoker] common.compile-core:
        [smoker]
        [smoker] compile-core:
        [smoker]
        [smoker] compile-test-framework:
        [smoker]
        [smoker] -check-git-state:
        [smoker]
        [smoker] -git-cleanroot:
        [smoker]
        [smoker] -copy-git-state:
        [smoker]
        [smoker] git-autoclean:
        [smoker]
        [smoker] ivy-availability-check:
        [smoker]
        [smoker] ivy-fail:
        [smoker]
        [smoker] ivy-configure:
        [smoker] [ivy:configure] :: loading settings :: file = /x1/jenkins/jenkins-slave/workspace/Lucene-Solr-SmokeRelease-5.5/lucene/build/smokeTestRelease/tmp/unpack/solr-5.5.2/lucene/ivy-settings.xml
        [smoker]
        [smoker] resolve:
        [smoker]
        [smoker] init:
        [smoker]
        [smoker] compile-lucene-core:
        [smoker]
        [smoker] compile-codecs:
        [smoker]
        [smoker] -check-git-state:
        [smoker]
        [smoker] -git-cleanroot:
        [smoker]
        [smoker] -copy-git-state:
        [smoker]
        [smoker] git-autoclean:
        [smoker]
        [smoker] ivy-availability-check:
        [smoker]
        [smoker] ivy-fail:
        [smoker]
        [smoker] ivy-configure:
        [smoker] [ivy:configure] :: loading settings :: file = /x1/jenkins/jenkins-slave/workspace/Lucene-Solr-SmokeRelease-5.5/lucene/build/smokeTestRelease/tmp/unpack/solr-5.5.2/lucene/ivy-settings.xml
        [smoker]
        [smoker] resolve:
        [smoker]
        [smoker] common.init:
        [smoker]
        [smoker] compile-lucene-core:
        [smoker]
        [smoker] init:
        [smoker]
        [smoker] -clover.disable:
        [smoker]
        [smoker] -clover.load:
        [smoker]
        [smoker] -clover.classpath:
        [smoker]
        [smoker] -clover.setup:
        [smoker]
        [smoker] clover:
        [smoker]
        [smoker] compile-core:
        [smoker]
        [smoker] -clover.disable:
        [smoker]
        [smoker] -clover.load:
        [smoker]
        [smoker] -clover.classpath:
        [smoker]
        [smoker] -clover.setup:
        [smoker]
        [smoker] clover:
        [smoker]
        [smoker] common.compile-core:
        [smoker]
        [smoker] compile-core:
        [smoker]
        [smoker] common.compile-test:
        [smoker]
        [smoker] -compile-analysis-extras:
        [smoker]
        [smoker] check-analyzers-icu-uptodate:
        [smoker]
        [smoker] jar-analyzers-icu:
        [smoker]
        [smoker] compile-solr-core:
        [smoker]
        [smoker] compile-solrj:
        [smoker]
        [smoker] check-lucene-core-uptodate:
        [smoker]
        [smoker] jar-lucene-core:
        [smoker]
        [smoker] check-backward-codecs-uptodate:
        [smoker]
        [smoker] jar-backward-codecs:
        [smoker]
        [smoker] check-analyzers-phonetic-uptodate:
        [smoker]
        [smoker] jar-analyzers-phonetic:
        [smoker]
        [smoker] check-analyzers-kuromoji-uptodate:
        [smoker]
        [smoker] jar-analyzers-kuromoji:
        [smoker]
        [smoker] check-codecs-uptodate:
        [smoker]
        [smoker] jar-codecs:
        [smoker]
        [smoker] check-expressions-uptodate:
        [smoker]
        [smoker] jar-expressions:
        [smoker]
        [smoker] check-suggest-uptodate:
        [smoker]
        [smoker] jar-suggest:
        [smoker]
        [smoker] check-highlighter-uptodate:
        [smoker]
        [smoker] jar-highlighter:
        [smoker]
        [smoker] check-memory-uptodate:
        [smoker]
        [smoker] jar-memory:
        [smoker]
        [smoker] check-misc-uptodate:
        [smoker]
        [smoker] jar-misc:
        [smoker]
        [smoker] check-spatial-uptodate:
        [smoker]
        [smoker] jar-spatial:
        [smoker]
        [smoker] check-grouping-uptodate:
        [smoker]
        [smoker] jar-grouping:
        [smoker]
        [smoker] check-queries-uptodate:
        [smoker]
        [smoker] jar-queries:
        [smoker]
        [smoker] check-queryparser-uptodate:
        [smoker]
        [smoker] jar-queryparser:
        [smoker]
        [smoker] check-join-uptodate:
        [smoker]
        [smoker] jar-join:
        [smoker]
        [smoker] check-sandbox-uptodate:
        [smoker]
        [smoker] jar-sandbox:
        [smoker]
        [smoker] prep-lucene-jars:
        [smoker]
        [smoker] resolve-example:
        [smoker]
        [smoker] ivy-availability-check:
        [smoker]
        [smoker] ivy-fail:
        [smoker]
        [smoker] ivy-configure:
        [smoker] [ivy:configure] :: loading settings :: file = /x1/jenkins/jenkins-slave/workspace/Lucene-Solr-SmokeRelease-5.5/lucene/build/smokeTestRelease/tmp/unpack/solr-5.5.2/lucene/ivy-settings.xml
        [smoker]
        [smoker] resolve:
        [smoker]
        [smoker] resolve-server:
        [smoker]
        [smoker] ivy-availability-check:
        [smoker]
        [smoker] ivy-fail:
        [smoker]
        [smoker] ivy-fail:
        [smoker]
        [smoker] ivy-configure:
        [smoker] [ivy:configure] :: loading settings :: file = /x1/jenkins/jenkins-slave/workspace/Lucene-Solr-SmokeRelease-5.5/lucene/build/smokeTestRelease/tmp/unpack/solr-5.5.2/lucene/ivy-settings.xml
        [smoker]
        [smoker] resolve:
        [smoker]
        [smoker] -check-git-state:
        [smoker]
        [smoker] -git-cleanroot:
        [smoker]
        [smoker] -copy-git-state:
        [smoker]
        [smoker] git-autoclean:
        [smoker]
        [smoker] ivy-availability-check:
        [smoker]
        [smoker] ivy-fail:
        [smoker]
        [smoker] ivy-fail:
        [smoker]
        [smoker] ivy-configure:
        [smoker] [ivy:configure] :: loading settings :: file = /x1/jenkins/jenkins-slave/workspace/Lucene-Solr-SmokeRelease-5.5/lucene/build/smokeTestRelease/tmp/unpack/solr-5.5.2/lucene/ivy-settings.xml
        [smoker]
        [smoker] resolve:
        [smoker]
        [smoker] common.init:
        [smoker]
        [smoker] compile-lucene-core:
        [smoker]
        [smoker] -check-git-state:
        [smoker]
        [smoker] -git-cleanroot:
        [smoker]
        [smoker] -copy-git-state:
        [smoker]
        [smoker] git-autoclean:
        [smoker]
        [smoker] ivy-availability-check:
        [smoker]
        [smoker] ivy-fail:
        [smoker]
        [smoker] ivy-configure:
        [smoker] [ivy:configure] :: loading settings :: file = /x1/jenkins/jenkins-slave/workspace/Lucene-Solr-SmokeRelease-5.5/lucene/build/smokeTestRelease/tmp/unpack/solr-5.5.2/lucene/ivy-settings.xml
        [smoker]
        [smoker] resolve:
        [smoker]
        [smoker] init:
        [smoker]
        [smoker] -clover.disable:
        [smoker]
        [smoker] -clover.load:
        [smoker]
        [smoker] -clover.classpath:
        [smoker]
        [smoker] -clover.setup:
        [smoker]
        [smoker] clover:
        [smoker]
        [smoker] compile-core:
        [smoker]
        [smoker] init:
        [smoker]
        [smoker] -clover.disable:
        [smoker]
        [smoker] -clover.load:
        [smoker]
        [smoker] -clover.classpath:
        [smoker]
        [smoker] -clover.setup:
        [smoker]
        [smoker] clover:
        [smoker]
        [smoker] common.compile-core:
        [smoker] [mkdir] Created dir: /x1/jenkins/jenkins-slave/workspace/Lucene-Solr-SmokeRelease-5.5/lucene/build/smokeTestRelease/tmp/unpack/solr-5.5.2/solr/build/solr-solrj/classes/java
        [smoker] [javac] Compiling 228 source files to /x1/jenkins/jenkins-slave/workspace/Lucene-Solr-SmokeRelease-5.5/lucene/build/smokeTestRelease/tmp/unpack/solr-5.5.2/solr/build/solr-solrj/classes/java
        [smoker] [javac] warning: [options] bootstrap class path not set in conjunction with -source 1.7
        [smoker] [javac] Note: Some input files use or override a deprecated API.
        [smoker] [javac] Note: Recompile with -Xlint:deprecation for details.
        [smoker] [javac] Note: Some input files use unchecked or unsafe operations.
        [smoker] [javac] Note: Recompile with -Xlint:unchecked for details.
        [smoker] [javac] 1 warning
        [smoker] [javac] Creating empty /x1/jenkins/jenkins-slave/workspace/Lucene-Solr-SmokeRelease-5.5/lucene/build/smokeTestRelease/tmp/unpack/solr-5.5.2/solr/build/solr-solrj/classes/java/org/apache/solr/client/solrj/request/schema/package-info.class
        [smoker] [javac] Creating empty /x1/jenkins/jenkins-slave/workspace/Lucene-Solr-SmokeRelease-5.5/lucene/build/smokeTestRelease/tmp/unpack/solr-5.5.2/solr/build/solr-solrj/classes/java/org/apache/solr/client/solrj/response/schema/package-info.class
        [smoker] [javac] Creating empty /x1/jenkins/jenkins-slave/workspace/Lucene-Solr-SmokeRelease-5.5/lucene/build/smokeTestRelease/tmp/unpack/solr-5.5.2/solr/build/solr-solrj/classes/java/org/apache/solr/client/solrj/beans/package-info.class
        [smoker] [javac] Creating empty /x1/jenkins/jenkins-slave/workspace/Lucene-Solr-SmokeRelease-5.5/lucene/build/smokeTestRelease/tmp/unpack/solr-5.5.2/solr/build/solr-solrj/classes/java/org/apache/solr/client/solrj/io/stream/expr/package-info.class
        [smoker] [javac] Creating empty /x1/jenkins/jenkins-slave/workspace/Lucene-Solr-SmokeRelease-5.5/lucene/build/smokeTestRelease/tmp/unpack/solr-5.5.2/solr/build/solr-solrj/classes/java/org/apache/solr/client/solrj/response/package-info.class
        [smoker] [javac] Creating empty /x1/jenkins/jenkins-slave/workspace/Lucene-Solr-SmokeRelease-5.5/lucene/build/smokeTestRelease/tmp/unpack/solr-5.5.2/solr/build/solr-solrj/classes/java/org/apache/solr/common/util/package-info.class
        [smoker] [javac] Creating empty /x1/jenkins/jenkins-slave/workspace/Lucene-Solr-SmokeRelease-5.5/lucene/build/smokeTestRelease/tmp/unpack/solr-5.5.2/solr/build/solr-solrj/classes/java/org/apache/solr/client/solrj/request/package-info.class
        [smoker] [javac] Creating empty /x1/jenkins/jenkins-slave/workspace/Lucene-Solr-SmokeRelease-5.5/lucene/build/smokeTestRelease/tmp/unpack/solr-5.5.2/solr/build/solr-solrj/classes/java/org/apache/solr/client/solrj/package-info.class
        [smoker] [javac] Creating empty /x1/jenkins/jenkins-slave/workspace/Lucene-Solr-SmokeRelease-5.5/lucene/build/smokeTestRelease/tmp/unpack/solr-5.5.2/solr/build/solr-solrj/classes/java/org/apache/solr/common/cloud/package-info.class
        [smoker] [javac] Creating empty /x1/jenkins/jenkins-slave/workspace/Lucene-Solr-SmokeRelease-5.5/lucene/build/smokeTestRelease/tmp/unpack/solr-5.5.2/solr/build/solr-solrj/classes/java/org/apache/solr/common/params/package-info.class
        [smoker] [javac] Creating empty /x1/jenkins/jenkins-slave/workspace/Lucene-Solr-SmokeRelease-5.5/lucene/build/smokeTestRelease/tmp/unpack/solr-5.5.2/solr/build/solr-solrj/classes/java/org/apache/solr/client/solrj/impl/package-info.class
        [smoker] [javac] Creating empty /x1/jenkins/jenkins-slave/workspace/Lucene-Solr-SmokeRelease-5.5/lucene/build/smokeTestRelease/tmp/unpack/solr-5.5.2/solr/build/solr-solrj/classes/java/org/apache/solr/common/luke/package-info.class
        [smoker] [javac] Creating empty /x1/jenkins/jenkins-slave/workspace/Lucene-Solr-SmokeRelease-5.5/lucene/build/smokeTestRelease/tmp/unpack/solr-5.5.2/solr/build/solr-solrj/classes/java/org/apache/solr/client/solrj/io/package-info.class
        [smoker] [javac] Creating empty /x1/jenkins/jenkins-slave/workspace/Lucene-Solr-SmokeRelease-5.5/lucene/build/smokeTestRelease/tmp/unpack/solr-5.5.2/solr/build/solr-solrj/classes/java/org/apache/solr/client/solrj/io/stream/package-info.class
        [smoker] [javac] Creating empty /x1/jenkins/jenkins-slave/workspace/Lucene-Solr-SmokeRelease-5.5/lucene/build/smokeTestRelease/tmp/unpack/solr-5.5.2/solr/build/solr-solrj/classes/java/org/apache/solr/common/package-info.class
        [smoker] [javac] Creating empty /x1/jenkins/jenkins-slave/workspace/Lucene-Solr-SmokeRelease-5.5/lucene/build/smokeTestRelease/tmp/unpack/solr-5.5.2/solr/build/solr-solrj/classes/java/org/apache/solr/client/solrj/io/comp/package-info.class
        [smoker] [javac] Creating empty /x1/jenkins/jenkins-slave/workspace/Lucene-Solr-SmokeRelease-5.5/lucene/build/smokeTestRelease/tmp/unpack/solr-5.5.2/solr/build/solr-solrj/classes/java/org/apache/solr/client/solrj/util/package-info.class
        [smoker]
        [smoker] compile-core:
        [smoker]
        [smoker] check-lucene-core-uptodate:
        [smoker]
        [smoker] jar-lucene-core:
        [smoker]
        [smoker] check-backward-codecs-uptodate:
        [smoker]
        [smoker] jar-backward-codecs:
        [smoker]
        [smoker] check-analyzers-phonetic-uptodate:
        [smoker]
        [smoker] jar-analyzers-phonetic:
        [smoker]
        [smoker] check-analyzers-kuromoji-uptodate:
        [smoker]
        [smoker] jar-analyzers-kuromoji:
        [smoker]
        [smoker] check-codecs-uptodate:
        [smoker]
        [smoker] jar-codecs:
        [smoker]
        [smoker] check-expressions-uptodate:
        [smoker]
        [smoker] jar-expressions:
        [smoker]
        [smoker] check-suggest-uptodate:
        [smoker]
        [smoker] jar-suggest:
        [smoker]
        [smoker] check-highlighter-uptodate:
        [smoker]
        [smoker] jar-highlighter:
        [smoker

    [...truncated too long message...]

    atusFlush
        [smoker] [junit4] > Assumption #1: 'slow' test group is disabled (@Slow())
        [smoker] [junit4] Completed [554/573 (1!)] on J0 in 0.02s, 2 tests, 2 skipped
        [smoker] [junit4]
        [smoker] [junit4] Suite: org.apache.solr.cloud.OverseerStatusTest
        [smoker] [junit4] IGNOR/A 0.00s J1 | OverseerStatusTest.test
        [smoker] [junit4] > Assumption #1: 'slow' test group is disabled (@Slow())
        [smoker] [junit4] Completed [555/573 (1!)] on J1 in 0.01s, 1 test, 1 skipped
        [smoker] [junit4]
        [smoker] [junit4] Suite: org.apache.solr.cloud.RecoveryAfterSoftCommitTest
        [smoker] [junit4] IGNOR/A 0.00s J2 | RecoveryAfterSoftCommitTest.test
        [smoker] [junit4] > Assumption #1: 'slow' test group is disabled (@Slow())
        [smoker] [junit4] Completed [556/573 (1!)] on J2 in 0.00s, 1 test, 1 skipped
        [smoker] [junit4]
        [smoker] [junit4] Suite: org.apache.solr.cloud.ShardRoutingCustomTest
        [smoker] [junit4] IGNOR/A 0.00s J0 | ShardRoutingCustomTest.test
        [smoker] [junit4] > Assumption #1: 'slow' test group is disabled (@Slow())
        [smoker] [junit4] Completed [557/573 (1!)] on J0 in 0.00s, 1 test, 1 skipped
        [smoker] [junit4]
        [smoker] [junit4] Suite: org.apache.solr.cloud.ShardRoutingTest
        [smoker] [junit4] IGNOR/A 0.00s J1 | ShardRoutingTest.test
        [smoker] [junit4] > Assumption #1: 'slow' test group is disabled (@Slow())
        [smoker] [junit4] Completed [558/573 (1!)] on J1 in 0.00s, 1 test, 1 skipped
        [smoker] [junit4]
        [smoker] [junit4] Suite: org.apache.solr.cloud.SharedFSAutoReplicaFailoverTest
        [smoker] [junit4] IGNOR/A 0.00s J2 | SharedFSAutoReplicaFailoverTest.test
        [smoker] [junit4] > Assumption #1: 'nightly' test group is disabled (@Nightly())
        [smoker] [junit4] Completed [559/573 (1!)] on J2 in 0.00s, 1 test, 1 skipped
        [smoker] [junit4]
        [smoker] [junit4] Suite: org.apache.solr.cloud.SyncSliceTest
        [smoker] [junit4] IGNOR/A 0.00s J0 | SyncSliceTest.test
        [smoker] [junit4] > Assumption #1: 'slow' test group is disabled (@Slow())
        [smoker] [junit4] Completed [560/573 (1!)] on J0 in 0.00s, 1 test, 1 skipped
        [smoker] [junit4]
        [smoker] [junit4] Suite: org.apache.solr.cloud.TestDistribDocBasedVersion
        [smoker] [junit4] IGNOR/A 0.00s J1 | TestDistribDocBasedVersion.test
        [smoker] [junit4] > Assumption #1: 'slow' test group is disabled (@Slow())
        [smoker] [junit4] Completed [561/573 (1!)] on J1 in 0.00s, 1 test, 1 skipped
        [smoker] [junit4]
        [smoker] [junit4] Suite: org.apache.solr.cloud.TestLeaderInitiatedRecoveryThread
        [smoker] [junit4] IGNOR/A 0.00s J2 | TestLeaderInitiatedRecoveryThread.testPublishDownState
        [smoker] [junit4] > Assumption #1: 'slow' test group is disabled (@Slow())
        [smoker] [junit4] Completed [562/573 (1!)] on J2 in 0.00s, 1 test, 1 skipped
        [smoker] [junit4]
        [smoker] [junit4] Suite: org.apache.solr.cloud.TestRandomRequestDistribution
        [smoker] [junit4] IGNOR/A 0.00s J0 | TestRandomRequestDistribution.test
        [smoker] [junit4] > Assumption #1: 'slow' test group is disabled (@Slow())
        [smoker] [junit4] Completed [563/573 (1!)] on J0 in 0.00s, 1 test, 1 skipped
        [smoker] [junit4]
        [smoker] [junit4] Suite: org.apache.solr.cloud.TestRebalanceLeaders
        [smoker] [junit4] IGNOR/A 0.00s J1 | TestRebalanceLeaders.test
        [smoker] [junit4] > Assumption #1: 'slow' test group is disabled (@Slow())
        [smoker] [junit4] Completed [564/573 (1!)] on J1 in 0.00s, 1 test, 1 skipped
        [smoker] [junit4]
        [smoker] [junit4] Suite: org.apache.solr.cloud.TestRequestStatusCollectionAPI
        [smoker] [junit4] IGNOR/A 0.00s J2 | TestRequestStatusCollectionAPI.test
        [smoker] [junit4] > Assumption #1: 'slow' test group is disabled (@Slow())
        [smoker] [junit4] Completed [565/573 (1!)] on J2 in 0.00s, 1 test, 1 skipped
        [smoker] [junit4]
        [smoker] [junit4] Suite: org.apache.solr.cloud.TestStressLiveNodes
        [smoker] [junit4] IGNOR/A 0.00s J0 | TestStressLiveNodes.testStress
        [smoker] [junit4] > Assumption #1: 'slow' test group is disabled (@Slow())
        [smoker] [junit4] Completed [566/573 (1!)] on J0 in 0.00s, 1 test, 1 skipped
        [smoker] [junit4]
        [smoker] [junit4] Suite: org.apache.solr.handler.TestSolrConfigHandlerCloud
        [smoker] [junit4] IGNOR/A 0.00s J1 | TestSolrConfigHandlerCloud.test
        [smoker] [junit4] > Assumption #1: 'slow' test group is disabled (@Slow())
        [smoker] [junit4] Completed [567/573 (1!)] on J1 in 0.00s, 1 test, 1 skipped
        [smoker] [junit4]
        [smoker] [junit4] Suite: org.apache.solr.internal.csv.CSVStrategyTest
        [smoker] [junit4] Completed [568/573 (1!)] on J2 in 0.00s, 5 tests
        [smoker] [junit4]
        [smoker] [junit4] Suite: org.apache.solr.request.TestFacetMethods
        [smoker] [junit4] Completed [569/573 (1!)] on J0 in 0.01s, 9 tests
        [smoker] [junit4]
        [smoker] [junit4] Suite: org.apache.solr.security.PKIAuthenticationIntegrationTest
        [smoker] [junit4] IGNOR/A 0.00s J1 | PKIAuthenticationIntegrationTest.testPkiAuth
        [smoker] [junit4] > Assumption #1: 'slow' test group is disabled (@Slow())
        [smoker] [junit4] Completed [570/573 (1!)] on J1 in 0.00s, 1 test, 1 skipped
        [smoker] [junit4]
        [smoker] [junit4] Suite: org.apache.solr.update.HardAutoCommitTest
        [smoker] [junit4] IGNOR/A 0.00s J2 | HardAutoCommitTest.testCommitWithin
        [smoker] [junit4] > Assumption #1: 'slow' test group is disabled (@Slow())
        [smoker] [junit4] Completed [572/573 (1!)] on J2 in 0.00s, 1 test, 1 skipped
        [smoker] [junit4]
        [smoker] [junit4]
        [smoker] [junit4] Tests with failures [seed: 102B3FF9E2C022EA]:
        [smoker] [junit4] - org.apache.solr.cloud.overseer.ZkStateReaderTest.testStateFormatUpdateWithExplicitRefresh
        [smoker] [junit4]
        [smoker] [junit4]
        [smoker] [junit4] JVM J0: 1.50 .. 569.90 = 568.40s
        [smoker] [junit4] JVM J1: 0.94 .. 569.40 = 568.46s
        [smoker] [junit4] JVM J2: 0.76 .. 569.63 = 568.87s
        [smoker] [junit4] Execution time total: 9 minutes 30 seconds
        [smoker] [junit4] Tests summary: 573 suites (7 ignored), 2319 tests, 1 error, 240 ignored (224 assumptions)
        [smoker]
        [smoker] BUILD FAILED
        [smoker] /x1/jenkins/jenkins-slave/workspace/Lucene-Solr-SmokeRelease-5.5/lucene/build/smokeTestRelease/tmp/unpack/solr-5.5.2/solr/build.xml:233: The following error occurred while executing this line:
        [smoker] /x1/jenkins/jenkins-slave/workspace/Lucene-Solr-SmokeRelease-5.5/lucene/build/smokeTestRelease/tmp/unpack/solr-5.5.2/solr/common-build.xml:534: The following error occurred while executing this line:
        [smoker] /x1/jenkins/jenkins-slave/workspace/Lucene-Solr-SmokeRelease-5.5/lucene/build/smokeTestRelease/tmp/unpack/solr-5.5.2/lucene/common-build.xml:1477: The following error occurred while executing this line:
        [smoker] /x1/jenkins/jenkins-slave/workspace/Lucene-Solr-SmokeRelease-5.5/lucene/build/smokeTestRelease/tmp/unpack/solr-5.5.2/lucene/common-build.xml:1033: There were test failures: 573 suites (7 ignored), 2319 tests, 1 error, 240 ignored (224 assumptions) [seed: 102B3FF9E2C022EA]
        [smoker]
        [smoker] Total time: 9 minutes 58 seconds
        [smoker]
        [smoker]
        [smoker] Traceback (most recent call last):
        [smoker] File "/x1/jenkins/jenkins-slave/workspace/Lucene-Solr-SmokeRelease-5.5/dev-tools/scripts/smokeTestRelease.py", line 1443, in <module>
        [smoker] main()
        [smoker] File "/x1/jenkins/jenkins-slave/workspace/Lucene-Solr-SmokeRelease-5.5/dev-tools/scripts/smokeTestRelease.py", line 1387, in main
        [smoker] smokeTest(c.java, c.url, c.revision, c.version, c.tmp_dir, c.is_signed, ' '.join(c.test_args))
        [smoker] File "/x1/jenkins/jenkins-slave/workspace/Lucene-Solr-SmokeRelease-5.5/dev-tools/scripts/smokeTestRelease.py", line 1433, in smokeTest
        [smoker] gitRevision, version, testArgs, baseURL)
        [smoker] File "/x1/jenkins/jenkins-slave/workspace/Lucene-Solr-SmokeRelease-5.5/dev-tools/scripts/smokeTestRelease.py", line 589, in unpackAndVerify
        [smoker] verifyUnpacked(java, project, artifact, unpackPath, gitRevision, version, testArgs, tmpDir, baseURL)
        [smoker] File "/x1/jenkins/jenkins-slave/workspace/Lucene-Solr-SmokeRelease-5.5/dev-tools/scripts/smokeTestRelease.py", line 717, in verifyUnpacked
        [smoker] java.run_java8('ant clean test -Dtests.slow=false %s' % testArgs, '%s/test.log' % unpackPath)
        [smoker] File "/x1/jenkins/jenkins-slave/workspace/Lucene-Solr-SmokeRelease-5.5/dev-tools/scripts/smokeTestRelease.py", line 1212, in run_java
        [smoker] run('%s; %s' % (cmd_prefix, cmd), logfile)
        [smoker] File "/x1/jenkins/jenkins-slave/workspace/Lucene-Solr-SmokeRelease-5.5/dev-tools/scripts/smokeTestRelease.py", line 514, in run
        [smoker] raise RuntimeError('command "%s" failed; see log file %s' % (command, logPath))
        [smoker] RuntimeError: command "export JAVA_HOME="/home/jenkins/jenkins-slave/tools/hudson.model.JDK/latest1.8" PATH="/home/jenkins/jenkins-slave/tools/hudson.model.JDK/latest1.8/bin:$PATH" JAVACMD="/home/jenkins/jenkins-slave/tools/hudson.model.JDK/latest1.8/bin/java"; ant clean test -Dtests.slow=false -Dtests.slow=false" failed; see log file /x1/jenkins/jenkins-slave/workspace/Lucene-Solr-SmokeRelease-5.5/lucene/build/smokeTestRelease/tmp/unpack/solr-5.5.2/test.log

    BUILD FAILED
    /x1/jenkins/jenkins-slave/workspace/Lucene-Solr-SmokeRelease-5.5/build.xml:545: exec returned: 1

    Total time: 104 minutes 2 seconds
    Build step 'Invoke Ant' marked build as failure
    Email was triggered for: Failure - Any
    Sending email for trigger: Failure - Any
    Setting LATEST1_8_HOME=/home/jenkins/jenkins-slave/tools/hudson.model.JDK/latest1.8
    Setting LATEST1_8_HOME=/home/jenkins/jenkins-slave/tools/hudson.model.JDK/latest1.8

Related Discussions

Discussion Navigation
viewthread | post
Discussion Overview
groupdev @
categorieslucene
postedJun 17, '16 at 5:10a
activeJun 18, '16 at 10:24a
posts2
users1
websitelucene.apache.org

1 user in discussion

Apache Jenkins Server: 2 posts

People

Translate

site design / logo © 2018 Grokbase