Grokbase Groups Lucene dev March 2016
FAQ
Build: http://jenkins.thetaphi.de/job/Lucene-Solr-5.5-Linux/203/
Java: 64bit/jdk1.7.0_80 -XX:-UseCompressedOops -XX:+UseConcMarkSweepGC

3 tests failed.
FAILED: junit.framework.TestSuite.org.apache.solr.cloud.CollectionsAPIDistributedZkTest

Error Message:
5 threads leaked from SUITE scope at org.apache.solr.cloud.CollectionsAPIDistributedZkTest: 1) Thread[id=6815, name=TEST-CollectionsAPIDistributedZkTest.test-seed#[51642D67BC875945]-SendThread(127.0.0.1:51425), state=TIMED_WAITING, group=TGRP-CollectionsAPIDistributedZkTest] at java.lang.Thread.sleep(Native Method) at org.apache.zookeeper.client.StaticHostProvider.next(StaticHostProvider.java:101) at org.apache.zookeeper.ClientCnxn$SendThread.startConnect(ClientCnxn.java:940) at org.apache.zookeeper.ClientCnxn$SendThread.run(ClientCnxn.java:1003) 2) Thread[id=12064, name=zkCallback-1042-thread-2, state=TIMED_WAITING, group=TGRP-CollectionsAPIDistributedZkTest] at sun.misc.Unsafe.park(Native Method) at java.util.concurrent.locks.LockSupport.parkNanos(LockSupport.java:226) at java.util.concurrent.SynchronousQueue$TransferStack.awaitFulfill(SynchronousQueue.java:460) at java.util.concurrent.SynchronousQueue$TransferStack.transfer(SynchronousQueue.java:359) at java.util.concurrent.SynchronousQueue.poll(SynchronousQueue.java:942) at java.util.concurrent.ThreadPoolExecutor.getTask(ThreadPoolExecutor.java:1068) at java.util.concurrent.ThreadPoolExecutor.runWorker(ThreadPoolExecutor.java:1130) at java.util.concurrent.ThreadPoolExecutor$Worker.run(ThreadPoolExecutor.java:615) at java.lang.Thread.run(Thread.java:745) 3) Thread[id=6817, name=zkCallback-1042-thread-1, state=TIMED_WAITING, group=TGRP-CollectionsAPIDistributedZkTest] at sun.misc.Unsafe.park(Native Method) at java.util.concurrent.locks.LockSupport.parkNanos(LockSupport.java:226) at java.util.concurrent.SynchronousQueue$TransferStack.awaitFulfill(SynchronousQueue.java:460) at java.util.concurrent.SynchronousQueue$TransferStack.transfer(SynchronousQueue.java:359) at java.util.concurrent.SynchronousQueue.poll(SynchronousQueue.java:942) at java.util.concurrent.ThreadPoolExecutor.getTask(ThreadPoolExecutor.java:1068) at java.util.concurrent.ThreadPoolExecutor.runWorker(ThreadPoolExecutor.java:1130) at java.util.concurrent.ThreadPoolExecutor$Worker.run(ThreadPoolExecutor.java:615) at java.lang.Thread.run(Thread.java:745) 4) Thread[id=6816, name=TEST-CollectionsAPIDistributedZkTest.test-seed#[51642D67BC875945]-EventThread, state=WAITING, group=TGRP-CollectionsAPIDistributedZkTest] at sun.misc.Unsafe.park(Native Method) at java.util.concurrent.locks.LockSupport.park(LockSupport.java:186) at java.util.concurrent.locks.AbstractQueuedSynchronizer$ConditionObject.await(AbstractQueuedSynchronizer.java:2043) at java.util.concurrent.LinkedBlockingQueue.take(LinkedBlockingQueue.java:442) at org.apache.zookeeper.ClientCnxn$EventThread.run(ClientCnxn.java:494) 5) Thread[id=12091, name=zkCallback-1042-thread-3, state=TIMED_WAITING, group=TGRP-CollectionsAPIDistributedZkTest] at sun.misc.Unsafe.park(Native Method) at java.util.concurrent.locks.LockSupport.parkNanos(LockSupport.java:226) at java.util.concurrent.SynchronousQueue$TransferStack.awaitFulfill(SynchronousQueue.java:460) at java.util.concurrent.SynchronousQueue$TransferStack.transfer(SynchronousQueue.java:359) at java.util.concurrent.SynchronousQueue.poll(SynchronousQueue.java:942) at java.util.concurrent.ThreadPoolExecutor.getTask(ThreadPoolExecutor.java:1068) at java.util.concurrent.ThreadPoolExecutor.runWorker(ThreadPoolExecutor.java:1130) at java.util.concurrent.ThreadPoolExecutor$Worker.run(ThreadPoolExecutor.java:615) at java.lang.Thread.run(Thread.java:745)

Stack Trace:
com.carrotsearch.randomizedtesting.ThreadLeakError: 5 threads leaked from SUITE scope at org.apache.solr.cloud.CollectionsAPIDistributedZkTest:
    1) Thread[id=6815, name=TEST-CollectionsAPIDistributedZkTest.test-seed#[51642D67BC875945]-SendThread(127.0.0.1:51425), state=TIMED_WAITING, group=TGRP-CollectionsAPIDistributedZkTest]
         at java.lang.Thread.sleep(Native Method)
         at org.apache.zookeeper.client.StaticHostProvider.next(StaticHostProvider.java:101)
         at org.apache.zookeeper.ClientCnxn$SendThread.startConnect(ClientCnxn.java:940)
         at org.apache.zookeeper.ClientCnxn$SendThread.run(ClientCnxn.java:1003)
    2) Thread[id=12064, name=zkCallback-1042-thread-2, state=TIMED_WAITING, group=TGRP-CollectionsAPIDistributedZkTest]
         at sun.misc.Unsafe.park(Native Method)
         at java.util.concurrent.locks.LockSupport.parkNanos(LockSupport.java:226)
         at java.util.concurrent.SynchronousQueue$TransferStack.awaitFulfill(SynchronousQueue.java:460)
         at java.util.concurrent.SynchronousQueue$TransferStack.transfer(SynchronousQueue.java:359)
         at java.util.concurrent.SynchronousQueue.poll(SynchronousQueue.java:942)
         at java.util.concurrent.ThreadPoolExecutor.getTask(ThreadPoolExecutor.java:1068)
         at java.util.concurrent.ThreadPoolExecutor.runWorker(ThreadPoolExecutor.java:1130)
         at java.util.concurrent.ThreadPoolExecutor$Worker.run(ThreadPoolExecutor.java:615)
         at java.lang.Thread.run(Thread.java:745)
    3) Thread[id=6817, name=zkCallback-1042-thread-1, state=TIMED_WAITING, group=TGRP-CollectionsAPIDistributedZkTest]
         at sun.misc.Unsafe.park(Native Method)
         at java.util.concurrent.locks.LockSupport.parkNanos(LockSupport.java:226)
         at java.util.concurrent.SynchronousQueue$TransferStack.awaitFulfill(SynchronousQueue.java:460)
         at java.util.concurrent.SynchronousQueue$TransferStack.transfer(SynchronousQueue.java:359)
         at java.util.concurrent.SynchronousQueue.poll(SynchronousQueue.java:942)
         at java.util.concurrent.ThreadPoolExecutor.getTask(ThreadPoolExecutor.java:1068)
         at java.util.concurrent.ThreadPoolExecutor.runWorker(ThreadPoolExecutor.java:1130)
         at java.util.concurrent.ThreadPoolExecutor$Worker.run(ThreadPoolExecutor.java:615)
         at java.lang.Thread.run(Thread.java:745)
    4) Thread[id=6816, name=TEST-CollectionsAPIDistributedZkTest.test-seed#[51642D67BC875945]-EventThread, state=WAITING, group=TGRP-CollectionsAPIDistributedZkTest]
         at sun.misc.Unsafe.park(Native Method)
         at java.util.concurrent.locks.LockSupport.park(LockSupport.java:186)
         at java.util.concurrent.locks.AbstractQueuedSynchronizer$ConditionObject.await(AbstractQueuedSynchronizer.java:2043)
         at java.util.concurrent.LinkedBlockingQueue.take(LinkedBlockingQueue.java:442)
         at org.apache.zookeeper.ClientCnxn$EventThread.run(ClientCnxn.java:494)
    5) Thread[id=12091, name=zkCallback-1042-thread-3, state=TIMED_WAITING, group=TGRP-CollectionsAPIDistributedZkTest]
         at sun.misc.Unsafe.park(Native Method)
         at java.util.concurrent.locks.LockSupport.parkNanos(LockSupport.java:226)
         at java.util.concurrent.SynchronousQueue$TransferStack.awaitFulfill(SynchronousQueue.java:460)
         at java.util.concurrent.SynchronousQueue$TransferStack.transfer(SynchronousQueue.java:359)
         at java.util.concurrent.SynchronousQueue.poll(SynchronousQueue.java:942)
         at java.util.concurrent.ThreadPoolExecutor.getTask(ThreadPoolExecutor.java:1068)
         at java.util.concurrent.ThreadPoolExecutor.runWorker(ThreadPoolExecutor.java:1130)
         at java.util.concurrent.ThreadPoolExecutor$Worker.run(ThreadPoolExecutor.java:615)
         at java.lang.Thread.run(Thread.java:745)
  at __randomizedtesting.SeedInfo.seed([51642D67BC875945]:0)


FAILED: junit.framework.TestSuite.org.apache.solr.cloud.CollectionsAPIDistributedZkTest

Error Message:
There are still zombie threads that couldn't be terminated: 1) Thread[id=12064, name=zkCallback-1042-thread-2, state=TIMED_WAITING, group=TGRP-CollectionsAPIDistributedZkTest] at sun.misc.Unsafe.park(Native Method) at java.util.concurrent.locks.LockSupport.parkNanos(LockSupport.java:226) at java.util.concurrent.SynchronousQueue$TransferStack.awaitFulfill(SynchronousQueue.java:460) at java.util.concurrent.SynchronousQueue$TransferStack.transfer(SynchronousQueue.java:359) at java.util.concurrent.SynchronousQueue.poll(SynchronousQueue.java:942) at java.util.concurrent.ThreadPoolExecutor.getTask(ThreadPoolExecutor.java:1068) at java.util.concurrent.ThreadPoolExecutor.runWorker(ThreadPoolExecutor.java:1130) at java.util.concurrent.ThreadPoolExecutor$Worker.run(ThreadPoolExecutor.java:615) at java.lang.Thread.run(Thread.java:745) 2) Thread[id=6817, name=zkCallback-1042-thread-1, state=TIMED_WAITING, group=TGRP-CollectionsAPIDistributedZkTest] at sun.misc.Unsafe.park(Native Method) at java.util.concurrent.locks.LockSupport.parkNanos(LockSupport.java:226) at java.util.concurrent.SynchronousQueue$TransferStack.awaitFulfill(SynchronousQueue.java:460) at java.util.concurrent.SynchronousQueue$TransferStack.transfer(SynchronousQueue.java:359) at java.util.concurrent.SynchronousQueue.poll(SynchronousQueue.java:942) at java.util.concurrent.ThreadPoolExecutor.getTask(ThreadPoolExecutor.java:1068) at java.util.concurrent.ThreadPoolExecutor.runWorker(ThreadPoolExecutor.java:1130) at java.util.concurrent.ThreadPoolExecutor$Worker.run(ThreadPoolExecutor.java:615) at java.lang.Thread.run(Thread.java:745) 3) Thread[id=12091, name=zkCallback-1042-thread-3, state=TIMED_WAITING, group=TGRP-CollectionsAPIDistributedZkTest] at sun.misc.Unsafe.park(Native Method) at java.util.concurrent.locks.LockSupport.parkNanos(LockSupport.java:226) at java.util.concurrent.SynchronousQueue$TransferStack.awaitFulfill(SynchronousQueue.java:460) at java.util.concurrent.SynchronousQueue$TransferStack.transfer(SynchronousQueue.java:359) at java.util.concurrent.SynchronousQueue.poll(SynchronousQueue.java:942) at java.util.concurrent.ThreadPoolExecutor.getTask(ThreadPoolExecutor.java:1068) at java.util.concurrent.ThreadPoolExecutor.runWorker(ThreadPoolExecutor.java:1130) at java.util.concurrent.ThreadPoolExecutor$Worker.run(ThreadPoolExecutor.java:615) at java.lang.Thread.run(Thread.java:745) 4) Thread[id=6815, name=TEST-CollectionsAPIDistributedZkTest.test-seed#[51642D67BC875945]-SendThread(127.0.0.1:51425), state=TIMED_WAITING, group=TGRP-CollectionsAPIDistributedZkTest] at java.lang.Thread.sleep(Native Method) at org.apache.zookeeper.ClientCnxn$SendThread.run(ClientCnxn.java:994)

Stack Trace:
com.carrotsearch.randomizedtesting.ThreadLeakError: There are still zombie threads that couldn't be terminated:
    1) Thread[id=12064, name=zkCallback-1042-thread-2, state=TIMED_WAITING, group=TGRP-CollectionsAPIDistributedZkTest]
         at sun.misc.Unsafe.park(Native Method)
         at java.util.concurrent.locks.LockSupport.parkNanos(LockSupport.java:226)
         at java.util.concurrent.SynchronousQueue$TransferStack.awaitFulfill(SynchronousQueue.java:460)
         at java.util.concurrent.SynchronousQueue$TransferStack.transfer(SynchronousQueue.java:359)
         at java.util.concurrent.SynchronousQueue.poll(SynchronousQueue.java:942)
         at java.util.concurrent.ThreadPoolExecutor.getTask(ThreadPoolExecutor.java:1068)
         at java.util.concurrent.ThreadPoolExecutor.runWorker(ThreadPoolExecutor.java:1130)
         at java.util.concurrent.ThreadPoolExecutor$Worker.run(ThreadPoolExecutor.java:615)
         at java.lang.Thread.run(Thread.java:745)
    2) Thread[id=6817, name=zkCallback-1042-thread-1, state=TIMED_WAITING, group=TGRP-CollectionsAPIDistributedZkTest]
         at sun.misc.Unsafe.park(Native Method)
         at java.util.concurrent.locks.LockSupport.parkNanos(LockSupport.java:226)
         at java.util.concurrent.SynchronousQueue$TransferStack.awaitFulfill(SynchronousQueue.java:460)
         at java.util.concurrent.SynchronousQueue$TransferStack.transfer(SynchronousQueue.java:359)
         at java.util.concurrent.SynchronousQueue.poll(SynchronousQueue.java:942)
         at java.util.concurrent.ThreadPoolExecutor.getTask(ThreadPoolExecutor.java:1068)
         at java.util.concurrent.ThreadPoolExecutor.runWorker(ThreadPoolExecutor.java:1130)
         at java.util.concurrent.ThreadPoolExecutor$Worker.run(ThreadPoolExecutor.java:615)
         at java.lang.Thread.run(Thread.java:745)
    3) Thread[id=12091, name=zkCallback-1042-thread-3, state=TIMED_WAITING, group=TGRP-CollectionsAPIDistributedZkTest]
         at sun.misc.Unsafe.park(Native Method)
         at java.util.concurrent.locks.LockSupport.parkNanos(LockSupport.java:226)
         at java.util.concurrent.SynchronousQueue$TransferStack.awaitFulfill(SynchronousQueue.java:460)
         at java.util.concurrent.SynchronousQueue$TransferStack.transfer(SynchronousQueue.java:359)
         at java.util.concurrent.SynchronousQueue.poll(SynchronousQueue.java:942)
         at java.util.concurrent.ThreadPoolExecutor.getTask(ThreadPoolExecutor.java:1068)
         at java.util.concurrent.ThreadPoolExecutor.runWorker(ThreadPoolExecutor.java:1130)
         at java.util.concurrent.ThreadPoolExecutor$Worker.run(ThreadPoolExecutor.java:615)
         at java.lang.Thread.run(Thread.java:745)
    4) Thread[id=6815, name=TEST-CollectionsAPIDistributedZkTest.test-seed#[51642D67BC875945]-SendThread(127.0.0.1:51425), state=TIMED_WAITING, group=TGRP-CollectionsAPIDistributedZkTest]
         at java.lang.Thread.sleep(Native Method)
         at org.apache.zookeeper.ClientCnxn$SendThread.run(ClientCnxn.java:994)
  at __randomizedtesting.SeedInfo.seed([51642D67BC875945]:0)


FAILED: org.apache.solr.cloud.CollectionsAPIDistributedZkTest.test

Error Message:
Error from server at http://127.0.0.1:51686/nw/ji/awholynewcollection_0: non ok status: 500, message:Server Error

Stack Trace:
org.apache.solr.client.solrj.impl.HttpSolrClient$RemoteSolrException: Error from server at http://127.0.0.1:51686/nw/ji/awholynewcollection_0: non ok status: 500, message:Server Error
  at __randomizedtesting.SeedInfo.seed([51642D67BC875945:D93012BD127B34BD]:0)
  at org.apache.solr.client.solrj.impl.HttpSolrClient.executeMethod(HttpSolrClient.java:510)
  at org.apache.solr.client.solrj.impl.HttpSolrClient.request(HttpSolrClient.java:240)
  at org.apache.solr.client.solrj.impl.HttpSolrClient.request(HttpSolrClient.java:229)
  at org.apache.solr.client.solrj.SolrRequest.process(SolrRequest.java:149)
  at org.apache.solr.client.solrj.SolrClient.query(SolrClient.java:942)
  at org.apache.solr.client.solrj.SolrClient.query(SolrClient.java:957)
  at org.apache.solr.cloud.AbstractFullDistribZkTestBase.waitForNon403or404or503(AbstractFullDistribZkTestBase.java:1753)
  at org.apache.solr.cloud.CollectionsAPIDistributedZkTest.testCollectionsAPI(CollectionsAPIDistributedZkTest.java:737)
  at org.apache.solr.cloud.CollectionsAPIDistributedZkTest.test(CollectionsAPIDistributedZkTest.java:160)
  at sun.reflect.NativeMethodAccessorImpl.invoke0(Native Method)
  at sun.reflect.NativeMethodAccessorImpl.invoke(NativeMethodAccessorImpl.java:57)
  at sun.reflect.DelegatingMethodAccessorImpl.invoke(DelegatingMethodAccessorImpl.java:43)
  at java.lang.reflect.Method.invoke(Method.java:606)
  at com.carrotsearch.randomizedtesting.RandomizedRunner.invoke(RandomizedRunner.java:1764)
  at com.carrotsearch.randomizedtesting.RandomizedRunner$8.evaluate(RandomizedRunner.java:871)
  at com.carrotsearch.randomizedtesting.RandomizedRunner$9.evaluate(RandomizedRunner.java:907)
  at com.carrotsearch.randomizedtesting.RandomizedRunner$10.evaluate(RandomizedRunner.java:921)
  at org.apache.solr.BaseDistributedSearchTestCase$ShardsRepeatRule$ShardsFixedStatement.callStatement(BaseDistributedSearchTestCase.java:964)
  at org.apache.solr.BaseDistributedSearchTestCase$ShardsRepeatRule$ShardsStatement.evaluate(BaseDistributedSearchTestCase.java:939)
  at com.carrotsearch.randomizedtesting.rules.SystemPropertiesRestoreRule$1.evaluate(SystemPropertiesRestoreRule.java:57)
  at org.apache.lucene.util.TestRuleSetupTeardownChained$1.evaluate(TestRuleSetupTeardownChained.java:49)
  at org.apache.lucene.util.AbstractBeforeAfterRule$1.evaluate(AbstractBeforeAfterRule.java:45)
  at org.apache.lucene.util.TestRuleThreadAndTestName$1.evaluate(TestRuleThreadAndTestName.java:48)
  at org.apache.lucene.util.TestRuleIgnoreAfterMaxFailures$1.evaluate(TestRuleIgnoreAfterMaxFailures.java:64)
  at org.apache.lucene.util.TestRuleMarkFailure$1.evaluate(TestRuleMarkFailure.java:47)
  at com.carrotsearch.randomizedtesting.rules.StatementAdapter.evaluate(StatementAdapter.java:36)
  at com.carrotsearch.randomizedtesting.ThreadLeakControl$StatementRunner.run(ThreadLeakControl.java:367)
  at com.carrotsearch.randomizedtesting.ThreadLeakControl.forkTimeoutingTask(ThreadLeakControl.java:809)
  at com.carrotsearch.randomizedtesting.ThreadLeakControl$3.evaluate(ThreadLeakControl.java:460)
  at com.carrotsearch.randomizedtesting.RandomizedRunner.runSingleTest(RandomizedRunner.java:880)
  at com.carrotsearch.randomizedtesting.RandomizedRunner$5.evaluate(RandomizedRunner.java:781)
  at com.carrotsearch.randomizedtesting.RandomizedRunner$6.evaluate(RandomizedRunner.java:816)
  at com.carrotsearch.randomizedtesting.RandomizedRunner$7.evaluate(RandomizedRunner.java:827)
  at com.carrotsearch.randomizedtesting.rules.StatementAdapter.evaluate(StatementAdapter.java:36)
  at com.carrotsearch.randomizedtesting.rules.SystemPropertiesRestoreRule$1.evaluate(SystemPropertiesRestoreRule.java:57)
  at org.apache.lucene.util.AbstractBeforeAfterRule$1.evaluate(AbstractBeforeAfterRule.java:45)
  at com.carrotsearch.randomizedtesting.rules.StatementAdapter.evaluate(StatementAdapter.java:36)
  at org.apache.lucene.util.TestRuleStoreClassName$1.evaluate(TestRuleStoreClassName.java:41)
  at com.carrotsearch.randomizedtesting.rules.NoShadowingOrOverridesOnMethodsRule$1.evaluate(NoShadowingOrOverridesOnMethodsRule.java:40)
  at com.carrotsearch.randomizedtesting.rules.NoShadowingOrOverridesOnMethodsRule$1.evaluate(NoShadowingOrOverridesOnMethodsRule.java:40)
  at com.carrotsearch.randomizedtesting.rules.StatementAdapter.evaluate(StatementAdapter.java:36)
  at com.carrotsearch.randomizedtesting.rules.StatementAdapter.evaluate(StatementAdapter.java:36)
  at com.carrotsearch.randomizedtesting.rules.StatementAdapter.evaluate(StatementAdapter.java:36)
  at org.apache.lucene.util.TestRuleAssertionsRequired$1.evaluate(TestRuleAssertionsRequired.java:53)
  at org.apache.lucene.util.TestRuleMarkFailure$1.evaluate(TestRuleMarkFailure.java:47)
  at org.apache.lucene.util.TestRuleIgnoreAfterMaxFailures$1.evaluate(TestRuleIgnoreAfterMaxFailures.java:64)
  at org.apache.lucene.util.TestRuleIgnoreTestSuites$1.evaluate(TestRuleIgnoreTestSuites.java:54)
  at com.carrotsearch.randomizedtesting.rules.StatementAdapter.evaluate(StatementAdapter.java:36)
  at com.carrotsearch.randomizedtesting.ThreadLeakControl$StatementRunner.run(ThreadLeakControl.java:367)
  at java.lang.Thread.run(Thread.java:745)




Build Log:
[...truncated 11497 lines...]
    [junit4] Suite: org.apache.solr.cloud.CollectionsAPIDistributedZkTest
    [junit4] 2> Creating dataDir: /home/jenkins/workspace/Lucene-Solr-5.5-Linux/solr/build/solr-core/test/J1/temp/solr.cloud.CollectionsAPIDistributedZkTest_51642D67BC875945-001/init-core-data-001
    [junit4] 2> 927033 INFO (SUITE-CollectionsAPIDistributedZkTest-seed#[51642D67BC875945]-worker) [ ] o.a.s.SolrTestCaseJ4 Randomized ssl (false) and clientAuth (false)
    [junit4] 2> 927033 INFO (SUITE-CollectionsAPIDistributedZkTest-seed#[51642D67BC875945]-worker) [ ] o.a.s.BaseDistributedSearchTestCase Setting hostContext system property: /nw/ji
    [junit4] 2> 927035 INFO (TEST-CollectionsAPIDistributedZkTest.test-seed#[51642D67BC875945]) [ ] o.a.s.c.ZkTestServer STARTING ZK TEST SERVER
    [junit4] 2> 927035 INFO (Thread-2572) [ ] o.a.s.c.ZkTestServer client port:0.0.0.0/0.0.0.0:0
    [junit4] 2> 927035 INFO (Thread-2572) [ ] o.a.s.c.ZkTestServer Starting server
    [junit4] 2> 927135 INFO (TEST-CollectionsAPIDistributedZkTest.test-seed#[51642D67BC875945]) [ ] o.a.s.c.ZkTestServer start zk server on port:51425
    [junit4] 2> 927135 INFO (TEST-CollectionsAPIDistributedZkTest.test-seed#[51642D67BC875945]) [ ] o.a.s.c.c.SolrZkClient Using default ZkCredentialsProvider
    [junit4] 2> 927135 INFO (TEST-CollectionsAPIDistributedZkTest.test-seed#[51642D67BC875945]) [ ] o.a.s.c.c.ConnectionManager Waiting for client to connect to ZooKeeper
    [junit4] 2> 927138 INFO (zkCallback-1006-thread-1) [ ] o.a.s.c.c.ConnectionManager Watcher org.apache.solr.common.cloud.ConnectionManager@53ecc30f name:ZooKeeperConnection Watcher:127.0.0.1:51425 got event WatchedEvent state:SyncConnected type:None path:null path:null type:None
    [junit4] 2> 927138 INFO (TEST-CollectionsAPIDistributedZkTest.test-seed#[51642D67BC875945]) [ ] o.a.s.c.c.ConnectionManager Client is connected to ZooKeeper
    [junit4] 2> 927138 INFO (TEST-CollectionsAPIDistributedZkTest.test-seed#[51642D67BC875945]) [ ] o.a.s.c.c.SolrZkClient Using default ZkACLProvider
    [junit4] 2> 927138 INFO (TEST-CollectionsAPIDistributedZkTest.test-seed#[51642D67BC875945]) [ ] o.a.s.c.c.SolrZkClient makePath: /solr
    [junit4] 2> 927139 INFO (TEST-CollectionsAPIDistributedZkTest.test-seed#[51642D67BC875945]) [ ] o.a.s.c.c.SolrZkClient Using default ZkCredentialsProvider
    [junit4] 2> 927140 INFO (TEST-CollectionsAPIDistributedZkTest.test-seed#[51642D67BC875945]) [ ] o.a.s.c.c.ConnectionManager Waiting for client to connect to ZooKeeper
    [junit4] 2> 927141 INFO (zkCallback-1007-thread-1) [ ] o.a.s.c.c.ConnectionManager Watcher org.apache.solr.common.cloud.ConnectionManager@7109cdb1 name:ZooKeeperConnection Watcher:127.0.0.1:51425/solr got event WatchedEvent state:SyncConnected type:None path:null path:null type:None
    [junit4] 2> 927141 INFO (TEST-CollectionsAPIDistributedZkTest.test-seed#[51642D67BC875945]) [ ] o.a.s.c.c.ConnectionManager Client is connected to ZooKeeper
    [junit4] 2> 927141 INFO (TEST-CollectionsAPIDistributedZkTest.test-seed#[51642D67BC875945]) [ ] o.a.s.c.c.SolrZkClient Using default ZkACLProvider
    [junit4] 2> 927141 INFO (TEST-CollectionsAPIDistributedZkTest.test-seed#[51642D67BC875945]) [ ] o.a.s.c.c.SolrZkClient makePath: /collections/collection1
    [junit4] 2> 927147 INFO (TEST-CollectionsAPIDistributedZkTest.test-seed#[51642D67BC875945]) [ ] o.a.s.c.c.SolrZkClient makePath: /collections/collection1/shards
    [junit4] 2> 927148 INFO (TEST-CollectionsAPIDistributedZkTest.test-seed#[51642D67BC875945]) [ ] o.a.s.c.c.SolrZkClient makePath: /collections/control_collection
    [junit4] 2> 927148 INFO (TEST-CollectionsAPIDistributedZkTest.test-seed#[51642D67BC875945]) [ ] o.a.s.c.c.SolrZkClient makePath: /collections/control_collection/shards
    [junit4] 2> 927149 INFO (TEST-CollectionsAPIDistributedZkTest.test-seed#[51642D67BC875945]) [ ] o.a.s.c.AbstractZkTestCase put /home/jenkins/workspace/Lucene-Solr-5.5-Linux/solr/core/src/test-files/solr/collection1/conf/solrconfig-tlog.xml to /configs/conf1/solrconfig.xml
    [junit4] 2> 927149 INFO (TEST-CollectionsAPIDistributedZkTest.test-seed#[51642D67BC875945]) [ ] o.a.s.c.c.SolrZkClient makePath: /configs/conf1/solrconfig.xml
    [junit4] 2> 927150 INFO (TEST-CollectionsAPIDistributedZkTest.test-seed#[51642D67BC875945]) [ ] o.a.s.c.AbstractZkTestCase put /home/jenkins/workspace/Lucene-Solr-5.5-Linux/solr/core/src/test-files/solr/collection1/conf/schema.xml to /configs/conf1/schema.xml
    [junit4] 2> 927150 INFO (TEST-CollectionsAPIDistributedZkTest.test-seed#[51642D67BC875945]) [ ] o.a.s.c.c.SolrZkClient makePath: /configs/conf1/schema.xml
    [junit4] 2> 927151 INFO (TEST-CollectionsAPIDistributedZkTest.test-seed#[51642D67BC875945]) [ ] o.a.s.c.AbstractZkTestCase put /home/jenkins/workspace/Lucene-Solr-5.5-Linux/solr/core/src/test-files/solr/collection1/conf/solrconfig.snippet.randomindexconfig.xml to /configs/conf1/solrconfig.snippet.randomindexconfig.xml
    [junit4] 2> 927151 INFO (TEST-CollectionsAPIDistributedZkTest.test-seed#[51642D67BC875945]) [ ] o.a.s.c.c.SolrZkClient makePath: /configs/conf1/solrconfig.snippet.randomindexconfig.xml
    [junit4] 2> 927152 INFO (TEST-CollectionsAPIDistributedZkTest.test-seed#[51642D67BC875945]) [ ] o.a.s.c.AbstractZkTestCase put /home/jenkins/workspace/Lucene-Solr-5.5-Linux/solr/core/src/test-files/solr/collection1/conf/stopwords.txt to /configs/conf1/stopwords.txt
    [junit4] 2> 927152 INFO (TEST-CollectionsAPIDistributedZkTest.test-seed#[51642D67BC875945]) [ ] o.a.s.c.c.SolrZkClient makePath: /configs/conf1/stopwords.txt
    [junit4] 2> 927152 INFO (TEST-CollectionsAPIDistributedZkTest.test-seed#[51642D67BC875945]) [ ] o.a.s.c.AbstractZkTestCase put /home/jenkins/workspace/Lucene-Solr-5.5-Linux/solr/core/src/test-files/solr/collection1/conf/protwords.txt to /configs/conf1/protwords.txt
    [junit4] 2> 927152 INFO (TEST-CollectionsAPIDistributedZkTest.test-seed#[51642D67BC875945]) [ ] o.a.s.c.c.SolrZkClient makePath: /configs/conf1/protwords.txt
    [junit4] 2> 927153 INFO (TEST-CollectionsAPIDistributedZkTest.test-seed#[51642D67BC875945]) [ ] o.a.s.c.AbstractZkTestCase put /home/jenkins/workspace/Lucene-Solr-5.5-Linux/solr/core/src/test-files/solr/collection1/conf/currency.xml to /configs/conf1/currency.xml
    [junit4] 2> 927153 INFO (TEST-CollectionsAPIDistributedZkTest.test-seed#[51642D67BC875945]) [ ] o.a.s.c.c.SolrZkClient makePath: /configs/conf1/currency.xml
    [junit4] 2> 927154 INFO (TEST-CollectionsAPIDistributedZkTest.test-seed#[51642D67BC875945]) [ ] o.a.s.c.AbstractZkTestCase put /home/jenkins/workspace/Lucene-Solr-5.5-Linux/solr/core/src/test-files/solr/collection1/conf/enumsConfig.xml to /configs/conf1/enumsConfig.xml
    [junit4] 2> 927154 INFO (TEST-CollectionsAPIDistributedZkTest.test-seed#[51642D67BC875945]) [ ] o.a.s.c.c.SolrZkClient makePath: /configs/conf1/enumsConfig.xml
    [junit4] 2> 927155 INFO (TEST-CollectionsAPIDistributedZkTest.test-seed#[51642D67BC875945]) [ ] o.a.s.c.AbstractZkTestCase put /home/jenkins/workspace/Lucene-Solr-5.5-Linux/solr/core/src/test-files/solr/collection1/conf/open-exchange-rates.json to /configs/conf1/open-exchange-rates.json
    [junit4] 2> 927155 INFO (TEST-CollectionsAPIDistributedZkTest.test-seed#[51642D67BC875945]) [ ] o.a.s.c.c.SolrZkClient makePath: /configs/conf1/open-exchange-rates.json
    [junit4] 2> 927155 INFO (TEST-CollectionsAPIDistributedZkTest.test-seed#[51642D67BC875945]) [ ] o.a.s.c.AbstractZkTestCase put /home/jenkins/workspace/Lucene-Solr-5.5-Linux/solr/core/src/test-files/solr/collection1/conf/mapping-ISOLatin1Accent.txt to /configs/conf1/mapping-ISOLatin1Accent.txt
    [junit4] 2> 927156 INFO (TEST-CollectionsAPIDistributedZkTest.test-seed#[51642D67BC875945]) [ ] o.a.s.c.c.SolrZkClient makePath: /configs/conf1/mapping-ISOLatin1Accent.txt
    [junit4] 2> 927156 INFO (TEST-CollectionsAPIDistributedZkTest.test-seed#[51642D67BC875945]) [ ] o.a.s.c.AbstractZkTestCase put /home/jenkins/workspace/Lucene-Solr-5.5-Linux/solr/core/src/test-files/solr/collection1/conf/old_synonyms.txt to /configs/conf1/old_synonyms.txt
    [junit4] 2> 927156 INFO (TEST-CollectionsAPIDistributedZkTest.test-seed#[51642D67BC875945]) [ ] o.a.s.c.c.SolrZkClient makePath: /configs/conf1/old_synonyms.txt
    [junit4] 2> 927157 INFO (TEST-CollectionsAPIDistributedZkTest.test-seed#[51642D67BC875945]) [ ] o.a.s.c.AbstractZkTestCase put /home/jenkins/workspace/Lucene-Solr-5.5-Linux/solr/core/src/test-files/solr/collection1/conf/synonyms.txt to /configs/conf1/synonyms.txt
    [junit4] 2> 927157 INFO (TEST-CollectionsAPIDistributedZkTest.test-seed#[51642D67BC875945]) [ ] o.a.s.c.c.SolrZkClient makePath: /configs/conf1/synonyms.txt
    [junit4] 2> 927211 INFO (TEST-CollectionsAPIDistributedZkTest.test-seed#[51642D67BC875945]) [ ] o.a.s.SolrTestCaseJ4 Writing core.properties file to /home/jenkins/workspace/Lucene-Solr-5.5-Linux/solr/build/solr-core/test/J1/temp/solr.cloud.CollectionsAPIDistributedZkTest_51642D67BC875945-001/control-001/cores/collection1
    [junit4] 2> 927212 INFO (TEST-CollectionsAPIDistributedZkTest.test-seed#[51642D67BC875945]) [ ] o.e.j.s.Server jetty-9.2.13.v20150730
    [junit4] 2> 927221 INFO (TEST-CollectionsAPIDistributedZkTest.test-seed#[51642D67BC875945]) [ ] o.e.j.s.h.ContextHandler Started o.e.j.s.ServletContextHandler@104934d8{/nw/ji,null,AVAILABLE}
    [junit4] 2> 927223 INFO (TEST-CollectionsAPIDistributedZkTest.test-seed#[51642D67BC875945]) [ ] o.e.j.s.ServerConnector Started ServerConnector@199817d7{HTTP/1.1}{127.0.0.1:55455}
    [junit4] 2> 927223 INFO (TEST-CollectionsAPIDistributedZkTest.test-seed#[51642D67BC875945]) [ ] o.e.j.s.Server Started @928779ms
    [junit4] 2> 927223 INFO (TEST-CollectionsAPIDistributedZkTest.test-seed#[51642D67BC875945]) [ ] o.a.s.c.s.e.JettySolrRunner Jetty properties: {hostContext=/nw/ji, coreRootDirectory=/home/jenkins/workspace/Lucene-Solr-5.5-Linux/solr/build/solr-core/test/J1/../../../../../../../../../home/jenkins/workspace/Lucene-Solr-5.5-Linux/solr/build/solr-core/test/J1/temp/solr.cloud.CollectionsAPIDistributedZkTest_51642D67BC875945-001/control-001/cores, solr.data.dir=/home/jenkins/workspace/Lucene-Solr-5.5-Linux/solr/build/solr-core/test/J1/temp/solr.cloud.CollectionsAPIDistributedZkTest_51642D67BC875945-001/tempDir-001/control/data, hostPort=55455}
    [junit4] 2> 927223 INFO (TEST-CollectionsAPIDistributedZkTest.test-seed#[51642D67BC875945]) [ ] o.a.s.s.SolrDispatchFilter SolrDispatchFilter.init(): sun.misc.Launcher$AppClassLoader@14327236
    [junit4] 2> 927223 INFO (TEST-CollectionsAPIDistributedZkTest.test-seed#[51642D67BC875945]) [ ] o.a.s.c.SolrResourceLoader new SolrResourceLoader for directory: '/home/jenkins/workspace/Lucene-Solr-5.5-Linux/solr/build/solr-core/test/J1/temp/solr.cloud.CollectionsAPIDistributedZkTest_51642D67BC875945-001/control-001'
    [junit4] 2> 927223 INFO (TEST-CollectionsAPIDistributedZkTest.test-seed#[51642D67BC875945]) [ ] o.a.s.c.SolrResourceLoader JNDI not configured for solr (NoInitialContextEx)
    [junit4] 2> 927223 INFO (TEST-CollectionsAPIDistributedZkTest.test-seed#[51642D67BC875945]) [ ] o.a.s.c.SolrResourceLoader solr home defaulted to 'solr/' (could not find system property or JNDI)
    [junit4] 2> 927224 INFO (TEST-CollectionsAPIDistributedZkTest.test-seed#[51642D67BC875945]) [ ] o.a.s.c.c.SolrZkClient Using default ZkCredentialsProvider
    [junit4] 2> 927224 INFO (TEST-CollectionsAPIDistributedZkTest.test-seed#[51642D67BC875945]) [ ] o.a.s.c.c.ConnectionManager Waiting for client to connect to ZooKeeper
    [junit4] 2> 927225 INFO (zkCallback-1008-thread-1) [ ] o.a.s.c.c.ConnectionManager Watcher org.apache.solr.common.cloud.ConnectionManager@29e86f59 name:ZooKeeperConnection Watcher:127.0.0.1:51425/solr got event WatchedEvent state:SyncConnected type:None path:null path:null type:None
    [junit4] 2> 927225 INFO (TEST-CollectionsAPIDistributedZkTest.test-seed#[51642D67BC875945]) [ ] o.a.s.c.c.ConnectionManager Client is connected to ZooKeeper
    [junit4] 2> 927226 INFO (TEST-CollectionsAPIDistributedZkTest.test-seed#[51642D67BC875945]) [ ] o.a.s.c.c.SolrZkClient Using default ZkACLProvider
    [junit4] 2> 927226 INFO (TEST-CollectionsAPIDistributedZkTest.test-seed#[51642D67BC875945]) [ ] o.a.s.s.SolrDispatchFilter Loading solr.xml from SolrHome (not found in ZooKeeper)
    [junit4] 2> 927226 INFO (TEST-CollectionsAPIDistributedZkTest.test-seed#[51642D67BC875945]) [ ] o.a.s.c.SolrXmlConfig Loading container configuration from /home/jenkins/workspace/Lucene-Solr-5.5-Linux/solr/build/solr-core/test/J1/temp/solr.cloud.CollectionsAPIDistributedZkTest_51642D67BC875945-001/control-001/solr.xml
    [junit4] 2> 927237 INFO (TEST-CollectionsAPIDistributedZkTest.test-seed#[51642D67BC875945]) [ ] o.a.s.c.CorePropertiesLocator Config-defined core root directory: /home/jenkins/workspace/Lucene-Solr-5.5-Linux/solr/build/solr-core/test/J1/../../../../../../../../../home/jenkins/workspace/Lucene-Solr-5.5-Linux/solr/build/solr-core/test/J1/temp/solr.cloud.CollectionsAPIDistributedZkTest_51642D67BC875945-001/control-001/cores
    [junit4] 2> 927238 INFO (TEST-CollectionsAPIDistributedZkTest.test-seed#[51642D67BC875945]) [ ] o.a.s.c.CoreContainer New CoreContainer 1529240291
    [junit4] 2> 927238 INFO (TEST-CollectionsAPIDistributedZkTest.test-seed#[51642D67BC875945]) [ ] o.a.s.c.CoreContainer Loading cores into CoreContainer [instanceDir=/home/jenkins/workspace/Lucene-Solr-5.5-Linux/solr/build/solr-core/test/J1/temp/solr.cloud.CollectionsAPIDistributedZkTest_51642D67BC875945-001/control-001]
    [junit4] 2> 927238 WARN (TEST-CollectionsAPIDistributedZkTest.test-seed#[51642D67BC875945]) [ ] o.a.s.c.CoreContainer Couldn't add files from /home/jenkins/workspace/Lucene-Solr-5.5-Linux/solr/build/solr-core/test/J1/temp/solr.cloud.CollectionsAPIDistributedZkTest_51642D67BC875945-001/control-001/lib to classpath: /home/jenkins/workspace/Lucene-Solr-5.5-Linux/solr/build/solr-core/test/J1/temp/solr.cloud.CollectionsAPIDistributedZkTest_51642D67BC875945-001/control-001/lib
    [junit4] 2> 927238 INFO (TEST-CollectionsAPIDistributedZkTest.test-seed#[51642D67BC875945]) [ ] o.a.s.h.c.HttpShardHandlerFactory created with socketTimeout : 90000,urlScheme : ,connTimeout : 15000,maxConnectionsPerHost : 20,maxConnections : 10000,corePoolSize : 0,maximumPoolSize : 2147483647,maxThreadIdleTime : 5,sizeOfQueue : -1,fairnessPolicy : false,useRetries : false,
    [junit4] 2> 927239 INFO (TEST-CollectionsAPIDistributedZkTest.test-seed#[51642D67BC875945]) [ ] o.a.s.u.UpdateShardHandler Creating UpdateShardHandler HTTP client with params: socketTimeout=340000&connTimeout=45000&retry=true
    [junit4] 2> 927239 INFO (TEST-CollectionsAPIDistributedZkTest.test-seed#[51642D67BC875945]) [ ] o.a.s.l.LogWatcher SLF4J impl is org.slf4j.impl.Log4jLoggerFactory
    [junit4] 2> 927239 INFO (TEST-CollectionsAPIDistributedZkTest.test-seed#[51642D67BC875945]) [ ] o.a.s.l.LogWatcher Registering Log Listener [Log4j (org.slf4j.impl.Log4jLoggerFactory)]
    [junit4] 2> 927240 INFO (TEST-CollectionsAPIDistributedZkTest.test-seed#[51642D67BC875945]) [ ] o.a.s.c.ZkContainer Zookeeper client=127.0.0.1:51425/solr
    [junit4] 2> 927240 INFO (TEST-CollectionsAPIDistributedZkTest.test-seed#[51642D67BC875945]) [ ] o.a.s.c.ZkController zkHost includes chroot
    [junit4] 2> 927240 INFO (TEST-CollectionsAPIDistributedZkTest.test-seed#[51642D67BC875945]) [ ] o.a.s.c.c.SolrZkClient Using default ZkCredentialsProvider
    [junit4] 2> 927240 INFO (TEST-CollectionsAPIDistributedZkTest.test-seed#[51642D67BC875945]) [ ] o.a.s.c.c.ConnectionManager Waiting for client to connect to ZooKeeper
    [junit4] 2> 927241 INFO (zkCallback-1011-thread-1) [ ] o.a.s.c.c.ConnectionManager Watcher org.apache.solr.common.cloud.ConnectionManager@66393052 name:ZooKeeperConnection Watcher:127.0.0.1:51425 got event WatchedEvent state:SyncConnected type:None path:null path:null type:None
    [junit4] 2> 927241 INFO (TEST-CollectionsAPIDistributedZkTest.test-seed#[51642D67BC875945]) [ ] o.a.s.c.c.ConnectionManager Client is connected to ZooKeeper
    [junit4] 2> 927241 INFO (TEST-CollectionsAPIDistributedZkTest.test-seed#[51642D67BC875945]) [ ] o.a.s.c.c.SolrZkClient Using default ZkACLProvider
    [junit4] 2> 927242 INFO (TEST-CollectionsAPIDistributedZkTest.test-seed#[51642D67BC875945]) [n:127.0.0.1:55455_nw%2Fji ] o.a.s.c.c.ConnectionManager Waiting for client to connect to ZooKeeper
    [junit4] 2> 927243 INFO (zkCallback-1012-thread-1-processing-n:127.0.0.1:55455_nw%2Fji) [n:127.0.0.1:55455_nw%2Fji ] o.a.s.c.c.ConnectionManager Watcher org.apache.solr.common.cloud.ConnectionManager@4367e139 name:ZooKeeperConnection Watcher:127.0.0.1:51425/solr got event WatchedEvent state:SyncConnected type:None path:null path:null type:None
    [junit4] 2> 927243 INFO (TEST-CollectionsAPIDistributedZkTest.test-seed#[51642D67BC875945]) [n:127.0.0.1:55455_nw%2Fji ] o.a.s.c.c.ConnectionManager Client is connected to ZooKeeper
    [junit4] 2> 927244 INFO (TEST-CollectionsAPIDistributedZkTest.test-seed#[51642D67BC875945]) [n:127.0.0.1:55455_nw%2Fji ] o.a.s.c.c.SolrZkClient makePath: /overseer/queue
    [junit4] 2> 927244 INFO (TEST-CollectionsAPIDistributedZkTest.test-seed#[51642D67BC875945]) [n:127.0.0.1:55455_nw%2Fji ] o.a.s.c.c.SolrZkClient makePath: /overseer/collection-queue-work
    [junit4] 2> 927246 INFO (TEST-CollectionsAPIDistributedZkTest.test-seed#[51642D67BC875945]) [n:127.0.0.1:55455_nw%2Fji ] o.a.s.c.c.SolrZkClient makePath: /overseer/collection-map-running
    [junit4] 2> 927246 INFO (TEST-CollectionsAPIDistributedZkTest.test-seed#[51642D67BC875945]) [n:127.0.0.1:55455_nw%2Fji ] o.a.s.c.c.SolrZkClient makePath: /overseer/collection-map-completed
    [junit4] 2> 927247 INFO (TEST-CollectionsAPIDistributedZkTest.test-seed#[51642D67BC875945]) [n:127.0.0.1:55455_nw%2Fji ] o.a.s.c.c.SolrZkClient makePath: /overseer/collection-map-failure
    [junit4] 2> 927248 INFO (TEST-CollectionsAPIDistributedZkTest.test-seed#[51642D67BC875945]) [n:127.0.0.1:55455_nw%2Fji ] o.a.s.c.c.SolrZkClient makePath: /live_nodes
    [junit4] 2> 927249 INFO (TEST-CollectionsAPIDistributedZkTest.test-seed#[51642D67BC875945]) [n:127.0.0.1:55455_nw%2Fji ] o.a.s.c.c.SolrZkClient makePath: /aliases.json
    [junit4] 2> 927249 INFO (TEST-CollectionsAPIDistributedZkTest.test-seed#[51642D67BC875945]) [n:127.0.0.1:55455_nw%2Fji ] o.a.s.c.c.SolrZkClient makePath: /clusterstate.json
    [junit4] 2> 927250 INFO (TEST-CollectionsAPIDistributedZkTest.test-seed#[51642D67BC875945]) [n:127.0.0.1:55455_nw%2Fji ] o.a.s.c.c.SolrZkClient makePath: /security.json
    [junit4] 2> 927251 INFO (TEST-CollectionsAPIDistributedZkTest.test-seed#[51642D67BC875945]) [n:127.0.0.1:55455_nw%2Fji ] o.a.s.c.ZkController Register node as live in ZooKeeper:/live_nodes/127.0.0.1:55455_nw%2Fji
    [junit4] 2> 927251 INFO (TEST-CollectionsAPIDistributedZkTest.test-seed#[51642D67BC875945]) [n:127.0.0.1:55455_nw%2Fji ] o.a.s.c.c.SolrZkClient makePath: /live_nodes/127.0.0.1:55455_nw%2Fji
    [junit4] 2> 927252 INFO (TEST-CollectionsAPIDistributedZkTest.test-seed#[51642D67BC875945]) [n:127.0.0.1:55455_nw%2Fji ] o.a.s.c.c.SolrZkClient makePath: /overseer_elect
    [junit4] 2> 927252 INFO (TEST-CollectionsAPIDistributedZkTest.test-seed#[51642D67BC875945]) [n:127.0.0.1:55455_nw%2Fji ] o.a.s.c.c.SolrZkClient makePath: /overseer_elect/election
    [junit4] 2> 927253 INFO (TEST-CollectionsAPIDistributedZkTest.test-seed#[51642D67BC875945]) [n:127.0.0.1:55455_nw%2Fji ] o.a.s.c.Overseer Overseer (id=null) closing
    [junit4] 2> 927253 INFO (TEST-CollectionsAPIDistributedZkTest.test-seed#[51642D67BC875945]) [n:127.0.0.1:55455_nw%2Fji ] o.a.s.c.LeaderElector Joined leadership election with path: /overseer_elect/election/95486761079144452-127.0.0.1:55455_nw%2Fji-n_0000000000
    [junit4] 2> 927254 INFO (TEST-CollectionsAPIDistributedZkTest.test-seed#[51642D67BC875945]) [n:127.0.0.1:55455_nw%2Fji ] o.a.s.c.OverseerElectionContext I am going to be the leader 127.0.0.1:55455_nw%2Fji
    [junit4] 2> 927254 INFO (TEST-CollectionsAPIDistributedZkTest.test-seed#[51642D67BC875945]) [n:127.0.0.1:55455_nw%2Fji ] o.a.s.c.c.SolrZkClient makePath: /overseer_elect/leader
    [junit4] 2> 927254 INFO (TEST-CollectionsAPIDistributedZkTest.test-seed#[51642D67BC875945]) [n:127.0.0.1:55455_nw%2Fji ] o.a.s.c.Overseer Overseer (id=95486761079144452-127.0.0.1:55455_nw%2Fji-n_0000000000) starting
    [junit4] 2> 927255 INFO (TEST-CollectionsAPIDistributedZkTest.test-seed#[51642D67BC875945]) [n:127.0.0.1:55455_nw%2Fji ] o.a.s.c.c.SolrZkClient makePath: /overseer/queue-work
    [junit4] 2> 927257 INFO (TEST-CollectionsAPIDistributedZkTest.test-seed#[51642D67BC875945]) [n:127.0.0.1:55455_nw%2Fji ] o.a.s.c.OverseerAutoReplicaFailoverThread Starting OverseerAutoReplicaFailoverThread autoReplicaFailoverWorkLoopDelay=10000 autoReplicaFailoverWaitAfterExpiration=10000 autoReplicaFailoverBadNodeExpiration=60000
    [junit4] 2> 927258 INFO (TEST-CollectionsAPIDistributedZkTest.test-seed#[51642D67BC875945]) [n:127.0.0.1:55455_nw%2Fji ] o.a.s.c.c.ZkStateReader Updating cluster state from ZooKeeper...
    [junit4] 2> 927258 INFO (OverseerCollectionConfigSetProcessor-95486761079144452-127.0.0.1:55455_nw%2Fji-n_0000000000) [n:127.0.0.1:55455_nw%2Fji ] o.a.s.c.OverseerTaskProcessor Process current queue of overseer operations
    [junit4] 2> 927258 INFO (OverseerStateUpdate-95486761079144452-127.0.0.1:55455_nw%2Fji-n_0000000000) [n:127.0.0.1:55455_nw%2Fji ] o.a.s.c.Overseer Starting to work on the main queue
    [junit4] 2> 927271 INFO (TEST-CollectionsAPIDistributedZkTest.test-seed#[51642D67BC875945]) [n:127.0.0.1:55455_nw%2Fji ] o.a.s.c.CoreContainer Security conf doesn't exist. Skipping setup for authorization module.
    [junit4] 2> 927271 INFO (TEST-CollectionsAPIDistributedZkTest.test-seed#[51642D67BC875945]) [n:127.0.0.1:55455_nw%2Fji ] o.a.s.c.CoreContainer No authentication plugin used.
    [junit4] 2> 927271 INFO (TEST-CollectionsAPIDistributedZkTest.test-seed#[51642D67BC875945]) [n:127.0.0.1:55455_nw%2Fji ] o.a.s.c.CorePropertiesLocator Looking for core definitions underneath /home/jenkins/workspace/Lucene-Solr-5.5-Linux/solr/build/solr-core/test/J1/../../../../../../../../../home/jenkins/workspace/Lucene-Solr-5.5-Linux/solr/build/solr-core/test/J1/temp/solr.cloud.CollectionsAPIDistributedZkTest_51642D67BC875945-001/control-001/cores
    [junit4] 2> 927272 INFO (TEST-CollectionsAPIDistributedZkTest.test-seed#[51642D67BC875945]) [n:127.0.0.1:55455_nw%2Fji ] o.a.s.c.CoreDescriptor Created CoreDescriptor: {dataDir=data/, transient=false, schema=schema.xml, coreNodeName=, shard=, config=solrconfig.xml, collection=control_collection, loadOnStartup=true, name=collection1, configSetProperties=configsetprops.json}
    [junit4] 2> 927272 INFO (TEST-CollectionsAPIDistributedZkTest.test-seed#[51642D67BC875945]) [n:127.0.0.1:55455_nw%2Fji ] o.a.s.c.CorePropertiesLocator Found core collection1 in /home/jenkins/workspace/Lucene-Solr-5.5-Linux/solr/build/solr-core/test/J1/../../../../../../../../../home/jenkins/workspace/Lucene-Solr-5.5-Linux/solr/build/solr-core/test/J1/temp/solr.cloud.CollectionsAPIDistributedZkTest_51642D67BC875945-001/control-001/cores/collection1
    [junit4] 2> 927272 INFO (TEST-CollectionsAPIDistributedZkTest.test-seed#[51642D67BC875945]) [n:127.0.0.1:55455_nw%2Fji ] o.a.s.c.CorePropertiesLocator Found 1 core definitions
    [junit4] 2> 927273 INFO (TEST-CollectionsAPIDistributedZkTest.test-seed#[51642D67BC875945]) [n:127.0.0.1:55455_nw%2Fji ] o.a.s.s.SolrDispatchFilter user.dir=/home/jenkins/workspace/Lucene-Solr-5.5-Linux/solr/build/solr-core/test/J1
    [junit4] 2> 927273 INFO (TEST-CollectionsAPIDistributedZkTest.test-seed#[51642D67BC875945]) [n:127.0.0.1:55455_nw%2Fji ] o.a.s.s.SolrDispatchFilter SolrDispatchFilter.init() done
    [junit4] 2> 927273 INFO (coreLoadExecutor-2889-thread-1-processing-n:127.0.0.1:55455_nw%2Fji) [n:127.0.0.1:55455_nw%2Fji c:control_collection x:collection1] o.a.s.c.ZkController publishing state=down
    [junit4] 2> 927273 INFO (coreLoadExecutor-2889-thread-1-processing-n:127.0.0.1:55455_nw%2Fji) [n:127.0.0.1:55455_nw%2Fji c:control_collection x:collection1] o.a.s.c.ZkController numShards not found on descriptor - reading it from system property
    [junit4] 2> 927274 INFO (coreLoadExecutor-2889-thread-1-processing-n:127.0.0.1:55455_nw%2Fji) [n:127.0.0.1:55455_nw%2Fji c:control_collection x:collection1] o.a.s.c.ZkController look for our core node name
    [junit4] 2> 927274 INFO (OverseerStateUpdate-95486761079144452-127.0.0.1:55455_nw%2Fji-n_0000000000) [n:127.0.0.1:55455_nw%2Fji ] o.a.s.c.Overseer processMessage: queueSize: 1, message = {
    [junit4] 2> "operation":"state",
    [junit4] 2> "numShards":"1",
    [junit4] 2> "collection":"control_collection",
    [junit4] 2> "node_name":"127.0.0.1:55455_nw%2Fji",
    [junit4] 2> "core":"collection1",
    [junit4] 2> "base_url":"http://127.0.0.1:55455/nw/ji",
    [junit4] 2> "shard":null,
    [junit4] 2> "roles":null,
    [junit4] 2> "state":"down"} current state version: 0
    [junit4] 2> 927275 INFO (OverseerStateUpdate-95486761079144452-127.0.0.1:55455_nw%2Fji-n_0000000000) [n:127.0.0.1:55455_nw%2Fji ] o.a.s.c.o.ReplicaMutator Update state numShards=1 message={
    [junit4] 2> "operation":"state",
    [junit4] 2> "numShards":"1",
    [junit4] 2> "collection":"control_collection",
    [junit4] 2> "node_name":"127.0.0.1:55455_nw%2Fji",
    [junit4] 2> "core":"collection1",
    [junit4] 2> "base_url":"http://127.0.0.1:55455/nw/ji",
    [junit4] 2> "shard":null,
    [junit4] 2> "roles":null,
    [junit4] 2> "state":"down"}
    [junit4] 2> 927275 INFO (OverseerStateUpdate-95486761079144452-127.0.0.1:55455_nw%2Fji-n_0000000000) [n:127.0.0.1:55455_nw%2Fji ] o.a.s.c.o.ClusterStateMutator building a new cName: control_collection
    [junit4] 2> 927275 INFO (OverseerStateUpdate-95486761079144452-127.0.0.1:55455_nw%2Fji-n_0000000000) [n:127.0.0.1:55455_nw%2Fji ] o.a.s.c.o.ReplicaMutator Assigning new node to shard shard=shard1
    [junit4] 2> 927276 INFO (zkCallback-1012-thread-1-processing-n:127.0.0.1:55455_nw%2Fji) [n:127.0.0.1:55455_nw%2Fji ] o.a.s.c.c.ZkStateReader A cluster state change: [WatchedEvent state:SyncConnected type:NodeDataChanged path:/clusterstate.json], has occurred - updating... (live nodes size: [1])
    [junit4] 2> 928275 INFO (coreLoadExecutor-2889-thread-1-processing-n:127.0.0.1:55455_nw%2Fji) [n:127.0.0.1:55455_nw%2Fji c:control_collection x:collection1] o.a.s.c.ZkController waiting to find shard id in clusterstate for collection1
    [junit4] 2> 928275 INFO (coreLoadExecutor-2889-thread-1-processing-n:127.0.0.1:55455_nw%2Fji) [n:127.0.0.1:55455_nw%2Fji c:control_collection x:collection1] o.a.s.c.ZkController Check for collection zkNode:control_collection
    [junit4] 2> 928275 INFO (coreLoadExecutor-2889-thread-1-processing-n:127.0.0.1:55455_nw%2Fji) [n:127.0.0.1:55455_nw%2Fji c:control_collection x:collection1] o.a.s.c.ZkController Collection zkNode exists
    [junit4] 2> 928275 INFO (coreLoadExecutor-2889-thread-1-processing-n:127.0.0.1:55455_nw%2Fji) [n:127.0.0.1:55455_nw%2Fji c:control_collection x:collection1] o.a.s.c.c.ZkStateReader Load collection config from: [/collections/control_collection]
    [junit4] 2> 928275 INFO (coreLoadExecutor-2889-thread-1-processing-n:127.0.0.1:55455_nw%2Fji) [n:127.0.0.1:55455_nw%2Fji c:control_collection x:collection1] o.a.s.c.c.ZkStateReader path=[/collections/control_collection] [configName]=[conf1] specified config exists in ZooKeeper
    [junit4] 2> 928275 INFO (coreLoadExecutor-2889-thread-1-processing-n:127.0.0.1:55455_nw%2Fji) [n:127.0.0.1:55455_nw%2Fji c:control_collection x:collection1] o.a.s.c.SolrResourceLoader new SolrResourceLoader for directory: '/home/jenkins/workspace/Lucene-Solr-5.5-Linux/solr/build/solr-core/test/J1/temp/solr.cloud.CollectionsAPIDistributedZkTest_51642D67BC875945-001/control-001/cores/collection1'
    [junit4] 2> 928275 INFO (coreLoadExecutor-2889-thread-1-processing-n:127.0.0.1:55455_nw%2Fji) [n:127.0.0.1:55455_nw%2Fji c:control_collection x:collection1] o.a.s.c.SolrResourceLoader JNDI not configured for solr (NoInitialContextEx)
    [junit4] 2> 928275 INFO (coreLoadExecutor-2889-thread-1-processing-n:127.0.0.1:55455_nw%2Fji) [n:127.0.0.1:55455_nw%2Fji c:control_collection x:collection1] o.a.s.c.SolrResourceLoader solr home defaulted to 'solr/' (could not find system property or JNDI)
    [junit4] 2> 928277 INFO (coreLoadExecutor-2889-thread-1-processing-n:127.0.0.1:55455_nw%2Fji) [n:127.0.0.1:55455_nw%2Fji c:control_collection x:collection1] o.a.s.c.Config loaded config solrconfig.xml with version 0
    [junit4] 2> 928280 INFO (coreLoadExecutor-2889-thread-1-processing-n:127.0.0.1:55455_nw%2Fji) [n:127.0.0.1:55455_nw%2Fji c:control_collection x:collection1] o.a.s.c.SolrConfig current version of requestparams : -1
    [junit4] 2> 928288 INFO (coreLoadExecutor-2889-thread-1-processing-n:127.0.0.1:55455_nw%2Fji) [n:127.0.0.1:55455_nw%2Fji c:control_collection x:collection1] o.a.s.c.SolrConfig Using Lucene MatchVersion: 5.5.0
    [junit4] 2> 928305 INFO (coreLoadExecutor-2889-thread-1-processing-n:127.0.0.1:55455_nw%2Fji) [n:127.0.0.1:55455_nw%2Fji c:control_collection x:collection1] o.a.s.c.SolrConfig Loaded SolrConfig: solrconfig.xml
    [junit4] 2> 928310 INFO (coreLoadExecutor-2889-thread-1-processing-n:127.0.0.1:55455_nw%2Fji) [n:127.0.0.1:55455_nw%2Fji c:control_collection x:collection1] o.a.s.s.IndexSchema [collection1] Schema name=test
    [junit4] 2> 928468 INFO (coreLoadExecutor-2889-thread-1-processing-n:127.0.0.1:55455_nw%2Fji) [n:127.0.0.1:55455_nw%2Fji c:control_collection x:collection1] o.a.s.s.OpenExchangeRatesOrgProvider Initialized with rates=open-exchange-rates.json, refreshInterval=1440.
    [junit4] 2> 928473 INFO (coreLoadExecutor-2889-thread-1-processing-n:127.0.0.1:55455_nw%2Fji) [n:127.0.0.1:55455_nw%2Fji c:control_collection x:collection1] o.a.s.s.IndexSchema default search field in schema is text
    [junit4] 2> 928474 INFO (coreLoadExecutor-2889-thread-1-processing-n:127.0.0.1:55455_nw%2Fji) [n:127.0.0.1:55455_nw%2Fji c:control_collection x:collection1] o.a.s.s.IndexSchema unique key field: id
    [junit4] 2> 928478 INFO (coreLoadExecutor-2889-thread-1-processing-n:127.0.0.1:55455_nw%2Fji) [n:127.0.0.1:55455_nw%2Fji c:control_collection x:collection1] o.a.s.s.FileExchangeRateProvider Reloading exchange rates from file currency.xml
    [junit4] 2> 928480 INFO (coreLoadExecutor-2889-thread-1-processing-n:127.0.0.1:55455_nw%2Fji) [n:127.0.0.1:55455_nw%2Fji c:control_collection x:collection1] o.a.s.s.FileExchangeRateProvider Reloading exchange rates from file currency.xml
    [junit4] 2> 928481 INFO (coreLoadExecutor-2889-thread-1-processing-n:127.0.0.1:55455_nw%2Fji) [n:127.0.0.1:55455_nw%2Fji c:control_collection x:collection1] o.a.s.s.OpenExchangeRatesOrgProvider Reloading exchange rates from open-exchange-rates.json
    [junit4] 2> 928482 INFO (coreLoadExecutor-2889-thread-1-processing-n:127.0.0.1:55455_nw%2Fji) [n:127.0.0.1:55455_nw%2Fji c:control_collection x:collection1] o.a.s.s.OpenExchangeRatesOrgProvider Reloading exchange rates from open-exchange-rates.json
    [junit4] 2> 928483 INFO (coreLoadExecutor-2889-thread-1-processing-n:127.0.0.1:55455_nw%2Fji) [n:127.0.0.1:55455_nw%2Fji c:control_collection x:collection1] o.a.s.c.ConfigSetProperties Did not find ConfigSet properties, assuming default properties: Can't find resource 'configsetprops.json' in classpath or '/configs/conf1', cwd=/home/jenkins/workspace/Lucene-Solr-5.5-Linux/solr/build/solr-core/test/J1
    [junit4] 2> 928483 INFO (coreLoadExecutor-2889-thread-1-processing-n:127.0.0.1:55455_nw%2Fji) [n:127.0.0.1:55455_nw%2Fji c:control_collection x:collection1] o.a.s.c.CoreContainer Creating SolrCore 'collection1' using configuration from collection control_collection
    [junit4] 2> 928483 INFO (coreLoadExecutor-2889-thread-1-processing-n:127.0.0.1:55455_nw%2Fji) [n:127.0.0.1:55455_nw%2Fji c:control_collection s:shard1 r:core_node1 x:collection1] o.a.s.c.SolrCore org.apache.solr.core.MockDirectoryFactory
    [junit4] 2> 928483 INFO (coreLoadExecutor-2889-thread-1-processing-n:127.0.0.1:55455_nw%2Fji) [n:127.0.0.1:55455_nw%2Fji c:control_collection s:shard1 r:core_node1 x:collection1] o.a.s.c.SolrCore [[collection1] ] Opening new SolrCore at [/home/jenkins/workspace/Lucene-Solr-5.5-Linux/solr/build/solr-core/test/J1/temp/solr.cloud.CollectionsAPIDistributedZkTest_51642D67BC875945-001/control-001/cores/collection1], dataDir=[/home/jenkins/workspace/Lucene-Solr-5.5-Linux/solr/build/solr-core/test/J1/../../../../../../../../../home/jenkins/workspace/Lucene-Solr-5.5-Linux/solr/build/solr-core/test/J1/temp/solr.cloud.CollectionsAPIDistributedZkTest_51642D67BC875945-001/control-001/cores/collection1/data/]
    [junit4] 2> 928483 INFO (coreLoadExecutor-2889-thread-1-processing-n:127.0.0.1:55455_nw%2Fji) [n:127.0.0.1:55455_nw%2Fji c:control_collection s:shard1 r:core_node1 x:collection1] o.a.s.c.JmxMonitoredMap JMX monitoring is enabled. Adding Solr mbeans to JMX Server: com.sun.jmx.mbeanserver.JmxMBeanServer@577e14e9
    [junit4] 2> 928484 INFO (coreLoadExecutor-2889-thread-1-processing-n:127.0.0.1:55455_nw%2Fji) [n:127.0.0.1:55455_nw%2Fji c:control_collection s:shard1 r:core_node1 x:collection1] o.a.s.c.CachingDirectoryFactory return new directory for /home/jenkins/workspace/Lucene-Solr-5.5-Linux/solr/build/solr-core/test/J1/../../../../../../../../../home/jenkins/workspace/Lucene-Solr-5.5-Linux/solr/build/solr-core/test/J1/temp/solr.cloud.CollectionsAPIDistributedZkTest_51642D67BC875945-001/control-001/cores/collection1/data
    [junit4] 2> 928484 INFO (coreLoadExecutor-2889-thread-1-processing-n:127.0.0.1:55455_nw%2Fji) [n:127.0.0.1:55455_nw%2Fji c:control_collection s:shard1 r:core_node1 x:collection1] o.a.s.c.SolrCore New index directory detected: old=null new=/home/jenkins/workspace/Lucene-Solr-5.5-Linux/solr/build/solr-core/test/J1/../../../../../../../../../home/jenkins/workspace/Lucene-Solr-5.5-Linux/solr/build/solr-core/test/J1/temp/solr.cloud.CollectionsAPIDistributedZkTest_51642D67BC875945-001/control-001/cores/collection1/data/index/
    [junit4] 2> 928484 WARN (coreLoadExecutor-2889-thread-1-processing-n:127.0.0.1:55455_nw%2Fji) [n:127.0.0.1:55455_nw%2Fji c:control_collection s:shard1 r:core_node1 x:collection1] o.a.s.c.SolrCore [collection1] Solr index directory '/home/jenkins/workspace/Lucene-Solr-5.5-Linux/solr/build/solr-core/test/J1/../../../../../../../../../home/jenkins/workspace/Lucene-Solr-5.5-Linux/solr/build/solr-core/test/J1/temp/solr.cloud.CollectionsAPIDistributedZkTest_51642D67BC875945-001/control-001/cores/collection1/data/index' doesn't exist. Creating new index...
    [junit4] 2> 928484 INFO (coreLoadExecutor-2889-thread-1-processing-n:127.0.0.1:55455_nw%2Fji) [n:127.0.0.1:55455_nw%2Fji c:control_collection s:shard1 r:core_node1 x:collection1] o.a.s.c.CachingDirectoryFactory return new directory for /home/jenkins/workspace/Lucene-Solr-5.5-Linux/solr/build/solr-core/test/J1/../../../../../../../../../home/jenkins/workspace/Lucene-Solr-5.5-Linux/solr/build/solr-core/test/J1/temp/solr.cloud.CollectionsAPIDistributedZkTest_51642D67BC875945-001/control-001/cores/collection1/data/index
    [junit4] 2> 928484 INFO (coreLoadExecutor-2889-thread-1-processing-n:127.0.0.1:55455_nw%2Fji) [n:127.0.0.1:55455_nw%2Fji c:control_collection s:shard1 r:core_node1 x:collection1] o.a.s.u.RandomMergePolicy RandomMergePolicy wrapping class org.apache.lucene.index.TieredMergePolicy: [TieredMergePolicy: maxMergeAtOnce=7, maxMergeAtOnceExplicit=2, maxMergedSegmentMB=52.103515625, floorSegmentMB=1.4033203125, forceMergeDeletesPctAllowed=25.727621898719928, segmentsPerTier=48.0, maxCFSSegmentSizeMB=8.796093022207999E12, noCFSRatio=0.0
    [junit4] 2> 928485 INFO (coreLoadExecutor-2889-thread-1-processing-n:127.0.0.1:55455_nw%2Fji) [n:127.0.0.1:55455_nw%2Fji c:control_collection s:shard1 r:core_node1 x:collection1] o.a.s.c.SolrDeletionPolicy SolrDeletionPolicy.onCommit: commits: num=1
    [junit4] 2> commit{dir=MockDirectoryWrapper(RAMDirectory@4e36f678 lockFactory=org.apache.lucene.store.SingleInstanceLockFactory@7a6f6865),segFN=segments_1,generation=1}
    [junit4] 2> 928485 INFO (coreLoadExecutor-2889-thread-1-processing-n:127.0.0.1:55455_nw%2Fji) [n:127.0.0.1:55455_nw%2Fji c:control_collection s:shard1 r:core_node1 x:collection1] o.a.s.c.SolrDeletionPolicy newest commit generation = 1
    [junit4] 2> 928485 INFO (OldIndexDirectoryCleanupThreadForCore-collection1) [n:127.0.0.1:55455_nw%2Fji c:control_collection s:shard1 r:core_node1 x:collection1] o.a.s.c.SolrCore Looking for old index directories to cleanup for core collection1 in /home/jenkins/workspace/Lucene-Solr-5.5-Linux/solr/build/solr-core/test/J1/../../../../../../../../../home/jenkins/workspace/Lucene-Solr-5.5-Linux/solr/build/solr-core/test/J1/temp/solr.cloud.CollectionsAPIDistributedZkTest_51642D67BC875945-001/control-001/cores/collection1/data/
    [junit4] 2> 928485 WARN (OldIndexDirectoryCleanupThreadForCore-collection1) [n:127.0.0.1:55455_nw%2Fji c:control_collection s:shard1 r:core_node1 x:collection1] o.a.s.c.DirectoryFactory /home/jenkins/workspace/Lucene-Solr-5.5-Linux/solr/build/solr-core/test/J1/../../../../../../../../../home/jenkins/workspace/Lucene-Solr-5.5-Linux/solr/build/solr-core/test/J1/temp/solr.cloud.CollectionsAPIDistributedZkTest_51642D67BC875945-001/control-001/cores/collection1/data/ does not point to a valid data directory; skipping clean-up of old index directories.
    [junit4] 2> 928488 INFO (coreLoadExecutor-2889-thread-1-processing-n:127.0.0.1:55455_nw%2Fji) [n:127.0.0.1:55455_nw%2Fji c:control_collection s:shard1 r:core_node1 x:collection1] o.a.s.u.p.UpdateRequestProcessorChain creating updateRequestProcessorChain "nodistrib"
    [junit4] 2> 928488 INFO (coreLoadExecutor-2889-thread-1-processing-n:127.0.0.1:55455_nw%2Fji) [n:127.0.0.1:55455_nw%2Fji c:control_collection s:shard1 r:core_node1 x:collection1] o.a.s.u.p.UpdateRequestProcessorChain creating updateRequestProcessorChain "dedupe"
    [junit4] 2> 928488 INFO (coreLoadExecutor-2889-thread-1-processing-n:127.0.0.1:55455_nw%2Fji) [n:127.0.0.1:55455_nw%2Fji c:control_collection s:shard1 r:core_node1 x:collection1] o.a.s.u.p.UpdateRequestProcessorChain inserting DistributedUpdateProcessorFactory into updateRequestProcessorChain "dedupe"
    [junit4] 2> 928488 INFO (coreLoadExecutor-2889-thread-1-processing-n:127.0.0.1:55455_nw%2Fji) [n:127.0.0.1:55455_nw%2Fji c:control_collection s:shard1 r:core_node1 x:collection1] o.a.s.u.p.UpdateRequestProcessorChain creating updateRequestProcessorChain "stored_sig"
    [junit4] 2> 928488 INFO (coreLoadExecutor-2889-thread-1-processing-n:127.0.0.1:55455_nw%2Fji) [n:127.0.0.1:55455_nw%2Fji c:control_collection s:shard1 r:core_node1 x:collection1] o.a.s.u.p.UpdateRequestProcessorChain inserting DistributedUpdateProcessorFactory into updateRequestProcessorChain "stored_sig"
    [junit4] 2> 928488 INFO (coreLoadExecutor-2889-thread-1-processing-n:127.0.0.1:55455_nw%2Fji) [n:127.0.0.1:55455_nw%2Fji c:control_collection s:shard1 r:core_node1 x:collection1] o.a.s.u.p.UpdateRequestProcessorChain creating updateRequestProcessorChain "distrib-dup-test-chain-explicit"
    [junit4] 2> 928489 INFO (coreLoadExecutor-2889-thread-1-processing-n:127.0.0.1:55455_nw%2Fji) [n:127.0.0.1:55455_nw%2Fji c:control_collection s:shard1 r:core_node1 x:collection1] o.a.s.u.p.UpdateRequestProcessorChain creating updateRequestProcessorChain "distrib-dup-test-chain-implicit"
    [junit4] 2> 928489 INFO (coreLoadExecutor-2889-thread-1-processing-n:127.0.0.1:55455_nw%2Fji) [n:127.0.0.1:55455_nw%2Fji c:control_collection s:shard1 r:core_node1 x:collection1] o.a.s.u.p.UpdateRequestProcessorChain inserting DistributedUpdateProcessorFactory into updateRequestProcessorChain "distrib-dup-test-chain-implicit"
    [junit4] 2> 928489 INFO (coreLoadExecutor-2889-thread-1-processing-n:127.0.0.1:55455_nw%2Fji) [n:127.0.0.1:55455_nw%2Fji c:control_collection s:shard1 r:core_node1 x:collection1] o.a.s.c.SolrCore no updateRequestProcessorChain defined as default, creating implicit default
    [junit4] 2> 928489 WARN (coreLoadExecutor-2889-thread-1-processing-n:127.0.0.1:55455_nw%2Fji) [n:127.0.0.1:55455_nw%2Fji c:control_collection s:shard1 r:core_node1 x:collection1] o.a.s.c.RequestHandlers INVALID paramSet a in requestHandler {type = requestHandler,name = /dump,class = DumpRequestHandler,args = {defaults={a=A,b=B}}}
    [junit4] 2> 928491 INFO (coreLoadExecutor-2889-thread-1-processing-n:127.0.0.1:55455_nw%2Fji) [n:127.0.0.1:55455_nw%2Fji c:control_collection s:shard1 r:core_node1 x:collection1] o.a.s.h.l.XMLLoader xsltCacheLifetimeSeconds=60
    [junit4] 2> 928491 INFO (coreLoadExecutor-2889-thread-1-processing-n:127.0.0.1:55455_nw%2Fji) [n:127.0.0.1:55455_nw%2Fji c:control_collection s:shard1 r:core_node1 x:collection1] o.a.s.h.l.XMLLoader xsltCacheLifetimeSeconds=60
    [junit4] 2> 928492 INFO (coreLoadExecutor-2889-thread-1-processing-n:127.0.0.1:55455_nw%2Fji) [n:127.0.0.1:55455_nw%2Fji c:control_collection s:shard1 r:core_node1 x:collection1] o.a.s.h.l.XMLLoader xsltCacheLifetimeSeconds=60
    [junit4] 2> 928493 INFO (coreLoadExecutor-2889-thread-1-processing-n:127.0.0.1:55455_nw%2Fji) [n:127.0.0.1:55455_nw%2Fji c:control_collection s:shard1 r:core_node1 x:collection1] o.a.s.h.l.XMLLoader xsltCacheLifetimeSeconds=60
    [junit4] 2> 928497 INFO (coreLoadExecutor-2889-thread-1-processing-n:127.0.0.1:55455_nw%2Fji) [n:127.0.0.1:55455_nw%2Fji c:control_collection s:shard1 r:core_node1 x:collection1] o.a.s.c.RequestHandlers Registered paths: standard,/replication,/config,/admin/mbeans,/update/json/docs,/admin/system,/admin/logging,/admin/threads,/get,/admin/ping,/dump,/admin/file,/admin/luke,/update/csv,/admin/plugins,/schema,/update/json,/admin/segments,/update,/admin/properties
    [junit4] 2> 928499 INFO (coreLoadExecutor-2889-thread-1-processing-n:127.0.0.1:55455_nw%2Fji) [n:127.0.0.1:55455_nw%2Fji c:control_collection s:shard1 r:core_node1 x:collection1] o.a.s.c.SolrCore Using default statsCache cache: org.apache.solr.search.stats.LocalStatsCache
    [junit4] 2> 928499 INFO (coreLoadExecutor-2889-thread-1-processing-n:127.0.0.1:55455_nw%2Fji) [n:127.0.0.1:55455_nw%2Fji c:control_collection s:shard1 r:core_node1 x:collection1] o.a.s.u.UpdateHandler Using UpdateLog implementation: org.apache.solr.update.UpdateLog
    [junit4] 2> 928499 INFO (coreLoadExecutor-2889-thread-1-processing-n:127.0.0.1:55455_nw%2Fji) [n:127.0.0.1:55455_nw%2Fji c:control_collection s:shard1 r:core_node1 x:collection1] o.a.s.u.UpdateLog Initializing UpdateLog: dataDir= defaultSyncLevel=FLUSH numRecordsToKeep=100 maxNumLogsToKeep=10 numVersionBuckets=65536
    [junit4] 2> 928500 INFO (coreLoadExecutor-2889-thread-1-processing-n:127.0.0.1:55455_nw%2Fji) [n:127.0.0.1:55455_nw%2Fji c:control_collection s:shard1 r:core_node1 x:collection1] o.a.s.u.CommitTracker Hard AutoCommit: disabled
    [junit4] 2> 928500 INFO (coreLoadExecutor-2889-thread-1-processing-n:127.0.0.1:55455_nw%2Fji) [n:127.0.0.1:55455_nw%2Fji c:control_collection s:shard1 r:core_node1 x:collection1] o.a.s.u.CommitTracker Soft AutoCommit: disabled
    [junit4] 2> 928500 INFO (coreLoadExecutor-2889-thread-1-processing-n:127.0.0.1:55455_nw%2Fji) [n:127.0.0.1:55455_nw%2Fji c:control_collection s:shard1 r:core_node1 x:collection1] o.a.s.u.RandomMergePolicy RandomMergePolicy wrapping class org.apache.lucene.index.LogDocMergePolicy: [LogDocMergePolicy: minMergeSize=1000, mergeFactor=50, maxMergeSize=9223372036854775807, maxMergeSizeForForcedMerge=9223372036854775807, calibrateSizeByDeletes=false, maxMergeDocs=2147483647, maxCFSSegmentSizeMB=8.796093022207999E12, noCFSRatio=0.6054224405628962]
    [junit4] 2> 928500 INFO (coreLoadExecutor-2889-thread-1-processing-n:127.0.0.1:55455_nw%2Fji) [n:127.0.0.1:55455_nw%2Fji c:control_collection s:shard1 r:core_node1 x:collection1] o.a.s.c.SolrDeletionPolicy SolrDeletionPolicy.onInit: commits: num=1
    [junit4] 2> commit{dir=MockDirectoryWrapper(RAMDirectory@4e36f678 lockFactory=org.apache.lucene.store.SingleInstanceLockFactory@7a6f6865),segFN=segments_1,generation=1}
    [junit4] 2> 928500 INFO (coreLoadExecutor-2889-thread-1-processing-n:127.0.0.1:55455_nw%2Fji) [n:127.0.0.1:55455_nw%2Fji c:control_collection s:shard1 r:core_node1 x:collection1] o.a.s.c.SolrDeletionPolicy newest commit generation = 1
    [junit4] 2> 928501 INFO (coreLoadExecutor-2889-thread-1-processing-n:127.0.0.1:55455_nw%2Fji) [n:127.0.0.1:55455_nw%2Fji c:control_collection s:shard1 r:core_node1 x:collection1] o.a.s.s.SolrIndexSearcher Opening Searcher@9881e66[collection1] main
    [junit4] 2> 928501 INFO (coreLoadExecutor-2889-thread-1-processing-n:127.0.0.1:55455_nw%2Fji) [n:127.0.0.1:55455_nw%2Fji c:control_collection s:shard1 r:core_node1 x:collection1] o.a.s.c.c.ZkStateReader Load collection config from: [/collections/control_collection]
    [junit4] 2> 928501 INFO (coreLoadExecutor-2889-thread-1-processing-n:127.0.0.1:55455_nw%2Fji) [n:127.0.0.1:55455_nw%2Fji c:control_collection s:shard1 r:core_node1 x:collection1] o.a.s.c.c.ZkStateReader path=[/collections/control_collection] [configName]=[conf1] specified config exists in ZooKeeper
    [junit4] 2> 928501 INFO (coreLoadExecutor-2889-thread-1-processing-n:127.0.0.1:55455_nw%2Fji) [n:127.0.0.1:55455_nw%2Fji c:control_collection s:shard1 r:core_node1 x:collection1] o.a.s.r.ManagedResourceStorage Setting up ZooKeeper-based storage for the RestManager with znodeBase: /configs/conf1
    [junit4] 2> 928501 INFO (coreLoadExecutor-2889-thread-1-processing-n:127.0.0.1:55455_nw%2Fji) [n:127.0.0.1:55455_nw%2Fji c:control_collection s:shard1 r:core_node1 x:collection1] o.a.s.r.ManagedResourceStorage Configured ZooKeeperStorageIO with znodeBase: /configs/conf1
    [junit4] 2> 928501 INFO (coreLoadExecutor-2889-thread-1-processing-n:127.0.0.1:55455_nw%2Fji) [n:127.0.0.1:55455_nw%2Fji c:control_collection s:shard1 r:core_node1 x:collection1] o.a.s.r.RestManager Initializing RestManager with initArgs: {}
    [junit4] 2> 928501 INFO (coreLoadExecutor-2889-thread-1-processing-n:127.0.0.1:55455_nw%2Fji) [n:127.0.0.1:55455_nw%2Fji c:control_collection s:shard1 r:core_node1 x:collection1] o.a.s.r.ManagedResourceStorage Reading _rest_managed.json using ZooKeeperStorageIO:path=/configs/conf1
    [junit4] 2> 928502 INFO (coreLoadExecutor-2889-thread-1-processing-n:127.0.0.1:55455_nw%2Fji) [n:127.0.0.1:55455_nw%2Fji c:control_collection s:shard1 r:core_node1 x:collection1] o.a.s.r.ManagedResourceStorage No data found for znode /configs/conf1/_rest_managed.json
    [junit4] 2> 928502 INFO (coreLoadExecutor-2889-thread-1-processing-n:127.0.0.1:55455_nw%2Fji) [n:127.0.0.1:55455_nw%2Fji c:control_collection s:shard1 r:core_node1 x:collection1] o.a.s.r.ManagedResourceStorage Loaded null at path _rest_managed.json using ZooKeeperStorageIO:path=/configs/conf1
    [junit4] 2> 928502 INFO (coreLoadExecutor-2889-thread-1-processing-n:127.0.0.1:55455_nw%2Fji) [n:127.0.0.1:55455_nw%2Fji c:control_collection s:shard1 r:core_node1 x:collection1] o.a.s.r.RestManager Initializing 0 registered ManagedResources
    [junit4] 2> 928502 INFO (coreLoadExecutor-2889-thread-1-processing-n:127.0.0.1:55455_nw%2Fji) [n:127.0.0.1:55455_nw%2Fji c:control_collection s:shard1 r:core_node1 x:collection1] o.a.s.h.ReplicationHandler Commits will be reserved for 10000
    [junit4] 2> 928503 INFO (searcherExecutor-2890-thread-1-processing-n:127.0.0.1:55455_nw%2Fji c:control_collection x:collection1 s:shard1 r:core_node1) [n:127.0.0.1:55455_nw%2Fji c:control_collection s:shard1 r:core_node1 x:collection1] o.a.s.c.SolrCore [collection1] Registered new searcher Searcher@9881e66[collection1] main{ExitableDirectoryReader(UninvertingDirectoryReader())}
    [junit4] 2> 928503 INFO (coreLoadExecutor-2889-thread-1-processing-n:127.0.0.1:55455_nw%2Fji) [n:127.0.0.1:55455_nw%2Fji c:control_collection s:shard1 r:core_node1 x:collection1] o.a.s.u.UpdateLog Looking up max value of version field to seed version buckets
    [junit4] 2> 928503 INFO (coreLoadExecutor-2889-thread-1-processing-n:127.0.0.1:55455_nw%2Fji) [n:127.0.0.1:55455_nw%2Fji c:control_collection s:shard1 r:core_node1 x:collection1] o.a.s.u.VersionInfo Refreshing highest value of _version_ for 65536 version buckets from index
    [junit4] 2> 928503 INFO (coreLoadExecutor-2889-thread-1-processing-n:127.0.0.1:55455_nw%2Fji) [n:127.0.0.1:55455_nw%2Fji c:control_collection s:shard1 r:core_node1 x:collection1] o.a.s.u.VersionInfo No terms found for _version_, cannot seed version bucket highest value from index
    [junit4] 2> 928503 INFO (coreLoadExecutor-2889-thread-1-processing-n:127.0.0.1:55455_nw%2Fji) [n:127.0.0.1:55455_nw%2Fji c:control_collection s:shard1 r:core_node1 x:collection1] o.a.s.u.UpdateLog Could not find max version in index or recent updates, using new clock 1527788178804572160
    [junit4] 2> 928505 INFO (coreLoadExecutor-2889-thread-1-processing-n:127.0.0.1:55455_nw%2Fji) [n:127.0.0.1:55455_nw%2Fji c:control_collection s:shard1 r:core_node1 x:collection1] o.a.s.u.UpdateLog Took 1.0ms to seed version buckets with highest version 1527788178804572160
    [junit4] 2> 928505 INFO (coreLoadExecutor-2889-thread-1-processing-n:127.0.0.1:55455_nw%2Fji) [n:127.0.0.1:55455_nw%2Fji c:control_collection s:shard1 r:core_node1 x:collection1] o.a.s.c.ZkController watch zkdir /configs/conf1
    [junit4] 2> 928505 INFO (coreLoadExecutor-2889-thread-1-processing-n:127.0.0.1:55455_nw%2Fji) [n:127.0.0.1:55455_nw%2Fji c:control_collection s:shard1 r:core_node1 x:collection1] o.a.s.c.CoreContainer registering core: collection1
    [junit4] 2> 928505 INFO (coreZkRegister-2883-thread-1-processing-n:127.0.0.1:55455_nw%2Fji c:control_collection x:collection1 s:shard1 r:core_node1) [n:127.0.0.1:55455_nw%2Fji c:control_collection s:shard1 r:core_node1 x:collection1] o.a.s.c.ZkController Register replica - core:collection1 address:http://127.0.0.1:55455/nw/ji collection:control_collection shard:shard1
    [junit4] 2> 928506 INFO (coreZkRegister-2883-thread-1-processing-n:127.0.0.1:55455_nw%2Fji c:control_collection x:collection1 s:shard1 r:core_node1) [n:127.0.0.1:55455_nw%2Fji c:control_collection s:shard1 r:core_node1 x:collection1] o.a.s.c.c.SolrZkClient makePath: /collections/control_collection/leader_elect/shard1/election
    [junit4] 2> 928507 INFO (coreZkRegister-2883-thread-1-processing-n:127.0.0.1:55455_nw%2Fji c:control_collection x:collection1 s:shard1 r:core_node1) [n:127.0.0.1:55455_nw%2Fji c:control_collection s:shard1 r:core_node1 x:collection1] o.a.s.c.LeaderElector Joined leadership election with path: /collections/control_collection/leader_elect/shard1/election/95486761079144452-core_node1-n_0000000000
    [junit4] 2> 928508 INFO (coreZkRegister-2883-thread-1-processing-n:127.0.0.1:55455_nw%2Fji c:control_collection x:collection1 s:shard1 r:core_node1) [n:127.0.0.1:55455_nw%2Fji c:control_collection s:shard1 r:core_node1 x:collection1] o.a.s.c.ShardLeaderElectionContext Running the leader process for shard=shard1 and weAreReplacement=false and leaderVoteWait=180000
    [junit4] 2> 928508 INFO (coreZkRegister-2883-thread-1-processing-n:127.0.0.1:55455_nw%2Fji c:control_collection x:collection1 s:shard1 r:core_node1) [n:127.0.0.1:55455_nw%2Fji c:control_collection s:shard1 r:core_node1 x:collection1] o.a.s.c.ShardLeaderElectionContext Enough replicas found to continue.
    [junit4] 2> 928508 INFO (coreZkRegister-2883-thread-1-processing-n:127.0.0.1:55455_nw%2Fji c:control_collection x:collection1 s:shard1 r:core_node1) [n:127.0.0.1:55455_nw%2Fji c:control_collection s:shard1 r:core_node1 x:collection1] o.a.s.c.ShardLeaderElectionContext I may be the new leader - try and sync
    [junit4] 2> 928508 INFO (coreZkRegister-2883-thread-1-processing-n:127.0.0.1:55455_nw%2Fji c:control_collection x:collection1 s:shard1 r:core_node1) [n:127.0.0.1:55455_nw%2Fji c:control_collection s:shard1 r:core_node1 x:collection1] o.a.s.c.SyncStrategy Sync replicas to http://127.0.0.1:55455/nw/ji/collection1/
    [junit4] 2> 928508 INFO (OverseerStateUpdate-95486761079144452-127.0.0.1:55455_nw%2Fji-n_0000000000) [n:127.0.0.1:55455_nw%2Fji ] o.a.s.c.Overseer processMessage: queueSize: 1, message = {
    [junit4] 2> "operation":"leader",
    [junit4] 2> "shard":"shard1",
    [junit4] 2> "collection":"control_collection"} current state version: 1
    [junit4] 2> 928508 INFO (coreZkRegister-2883-thread-1-processing-n:127.0.0.1:55455_nw%2Fji c:control_collection x:collection1 s:shard1 r:core_node1) [n:127.0.0.1:55455_nw%2Fji c:control_collection s:shard1 r:core_node1 x:collection1] o.a.s.c.SyncStrategy Sync Success - now sync replicas to me
    [junit4] 2> 928508 INFO (coreZkRegister-2883-thread-1-processing-n:127.0.0.1:55455_nw%2Fji c:control_collection x:collection1 s:shard1 r:core_node1) [n:127.0.0.1:55455_nw%2Fji c:control_collection s:shard1 r:core_node1 x:collection1] o.a.s.c.SyncStrategy http://127.0.0.1:55455/nw/ji/collection1/ has no replicas
    [junit4] 2> 928509 INFO (coreZkRegister-2883-thread-1-processing-n:127.0.0.1:55455_nw%2Fji c:control_collection x:collection1 s:shard1 r:core_node1) [n:127.0.0.1:55455_nw%2Fji c:control_collection s:shard1 r:core_node1 x:collection1] o.a.s.c.c.SolrZkClient makePath: /collections/control_collection/leaders/shard1
    [junit4] 2> 928510 INFO (coreZkRegister-2883-thread-1-processing-n:127.0.0.1:55455_nw%2Fji c:control_collection x:collection1 s:shard1 r:core_node1) [n:127.0.0.1:55455_nw%2Fji c:control_collection s:shard1 r:core_node1 x:collection1] o.a.s.c.ShardLeaderElectionContextBase Creating leader registration node
    [junit4] 2> 928511 INFO (coreZkRegister-2883-thread-1-processing-n:127.0.0.1:55455_nw%2Fji c:control_collection x:collection1 s:shard1 r:core_node1) [n:127.0.0.1:55455_nw%2Fji c:control_collection s:shard1 r:core_node1 x:collection1] o.a.s.c.ShardLeaderElectionContext I am the new leader: http://127.0.0.1:55455/nw/ji/collection1/ shard1
    [junit4] 2> 928511 INFO (OverseerStateUpdate-95486761079144452-127.0.0.1:55455_nw%2Fji-n_0000000000) [n:127.0.0.1:55455_nw%2Fji ] o.a.s.c.Overseer processMessage: queueSize: 1, message = {
    [junit4] 2> "operation":"leader",
    [junit4] 2> "shard":"shard1",
    [junit4] 2> "collection":"control_collection",
    [junit4] 2> "base_url":"http://127.0.0.1:55455/nw/ji",
    [junit4] 2> "core":"collection1",
    [junit4] 2> "state":"active"} current state version: 1
    [junit4] 2> 928612 INFO (zkCallback-1012-thread-1-processing-n:127.0.0.1:55455_nw%2Fji) [n:127.0.0.1:55455_nw%2Fji ] o.a.s.c.c.ZkStateReader A cluster state change: [WatchedEvent state:SyncConnected type:NodeDataChanged path:/clusterstate.json], has occurred - updating... (live nodes size: [1])
    [junit4] 2> 928661 INFO (coreZkRegister-2883-thread-1-processing-n:127.0.0.1:55455_nw%2Fji c:control_collection x:collection1 s:shard1 r:core_node1) [n:127.0.0.1:55455_nw%2Fji c:control_collection s:shard1 r:core_node1 x:collection1] o.a.s.c.ZkController We are http://127.0.0.1:55455/nw/ji/collection1/ and leader is http://127.0.0.1:55455/nw/ji/collection1/
    [junit4] 2> 928662 INFO (coreZkRegister-2883-thread-1-processing-n:127.0.0.1:55455_nw%2Fji c:control_collection x:collection1 s:shard1 r:core_node1) [n:127.0.0.1:55455_nw%2Fji c:control_collection s:shard1 r:core_node1 x:collection1] o.a.s.c.ZkController No LogReplay needed for core=collection1 baseURL=http://127.0.0.1:55455/nw/ji
    [junit4] 2> 928662 INFO (coreZkRegister-2883-thread-1-processing-n:127.0.0.1:55455_nw%2Fji c:control_collection x:collection1 s:shard1 r:core_node1) [n:127.0.0.1:55455_nw%2Fji c:control_collection s:shard1 r:core_node1 x:collection1] o.a.s.c.ZkController I am the leader, no recovery necessary
    [junit4] 2> 928662 INFO (coreZkRegister-2883-thread-1-processing-n:127.0.0.1:55455_nw%2Fji c:control_collection x:collection1 s:shard1 r:core_node1) [n:127.0.0.1:55455_nw%2Fji c:control_collection s:shard1 r:core_node1 x:collection1] o.a.s.c.ZkController publishing state=active
    [junit4] 2> 928662 INFO (coreZkRegister-2883-thread-1-processing-n:127.0.0.1:55455_nw%2Fji c:control_collection x:collection1 s:shard1 r:core_node1) [n:127.0.0.1:55455_nw%2Fji c:control_collection s:shard1 r:core_node1 x:collection1] o.a.s.c.ZkController numShards not found on descriptor - reading it from system property
    [junit4] 2> 928663 INFO (OverseerStateUpdate-95486761079144452-127.0.0.1:55455_nw%2Fji-n_0000000000) [n:127.0.0.1:55455_nw%2Fji ] o.a.s.c.Overseer processMessage: queueSize: 1, message = {
    [junit4] 2> "operation":"state",
    [junit4] 2> "numShards":"1",
    [junit4] 2> "collection":"control_collection",
    [junit4] 2> "node_name":"127.0.0.1:55455_nw%2Fji",
    [junit4] 2> "core":"collection1",
    [junit4] 2> "base_url":"http://127.0.0.1:55455/nw/ji",
    [junit4] 2> "shard":"shard1",
    [junit4] 2> "core_node_name":"core_node1",
    [junit4] 2> "roles":null,
    [junit4] 2> "state":"active"} current state version: 2
    [junit4] 2> 928663 INFO (OverseerStateUpdate-95486761079144452-127.0.0.1:55455_nw%2Fji-n_0000000000) [n:127.0.0.1:55455_nw%2Fji ] o.a.s.c.o.ReplicaMutator Update state numShards=1 message={
    [junit4] 2> "operation":"state",
    [junit4] 2> "numShards":"1",
    [junit4] 2> "collection":"control_collection",
    [junit4] 2> "node_name":"127.0.0.1:55455_nw%2Fji",
    [junit4] 2> "core":"collection1",
    [junit4] 2> "base_url":"http://127.0.0.1:55455/nw/ji",
    [junit4] 2> "shard":"shard1",
    [junit4] 2> "core_node_name":"core_node1",
    [junit4] 2> "roles":null,
    [junit4] 2> "state":"active"}
    [junit4] 2> 928764 INFO (zkCallback-1012-thread-1-processing-n:127.0.0.1:55455_nw%2Fji) [n:127.0.0.1:55455_nw%2Fji ] o.a.s.c.c.ZkStateReader A cluster state change: [WatchedEvent state:SyncConnected type:NodeDataChanged path:/clusterstate.json], has occurred - updating... (live nodes size: [1])
    [junit4] 2> 928774 INFO (TEST-CollectionsAPIDistributedZkTest.test-seed#[51642D67BC875945]) [ ] o.a.s.c.c.SolrZkClient Using default ZkCredentialsProvider
    [junit4] 2> 928774 INFO (TEST-CollectionsAPIDistributedZkTest.test-seed#[51642D67BC875945]) [ ] o.a.s.c.c.ConnectionManager Waiting for client to connect to ZooKeeper
    [junit4] 2> 928775 INFO (zkCallback-1014-thread-1) [ ] o.a.s.c.c.ConnectionManager Watcher org.apache.solr.common.cloud.ConnectionManager@5d20f14d name:ZooKeeperConnection Watcher:127.0.0.1:51425/solr got event WatchedEvent state:SyncConnected type:None path:null path:null type:None
    [junit4] 2> 928776 INFO (TEST-CollectionsAPIDistributedZkTest.test-seed#[51642D67BC875945]) [ ] o.a.s.c.c.ConnectionManager Client is connected to ZooKeeper
    [junit4] 2> 928776 INFO (TEST-CollectionsAPIDistributedZkTest.test-seed#[51642D67BC875945]) [ ] o.a.s.c.c.SolrZkClient Using default ZkACLProvider
    [junit4] 2> 928776 INFO (TEST-CollectionsAPIDistributedZkTest.test-seed#[51642D67BC875945]) [ ] o.a.s.c.c.ZkStateReader Updating cluster state from ZooKeeper...
    [junit4] 2> 928777 INFO (TEST-CollectionsAPIDistributedZkTest.test-seed#[51642D67BC875945]) [ ] o.a.s.c.ChaosMonkey monkey: init - expire sessions:false cause connection loss:false
    [junit4] 2> 928828 INFO (TEST-CollectionsAPIDistributedZkTest.test-seed#[51642D67BC875945]) [ ] o.a.s.SolrTestCaseJ4 Writing core.properties file to /home/jenkins/workspace/Lucene-Solr-5.5-Linux/solr/build/solr-core/test/J1/temp/solr.cloud.CollectionsAPIDistributedZkTest_51642D67BC875945-001/shard-1-001/cores/collection1
    [junit4] 2> 928829 INFO (TEST-CollectionsAPIDistributedZkTest.test-seed#[51642D67BC875945]) [ ] o.a.s.c.AbstractFullDistribZkTestBase create jetty 1 in directory /home/jenkins/workspace/Lucene-Solr-5.5-Linux/solr/build/solr-core/test/J1/temp/solr.cloud.CollectionsAPIDistributedZkTest_51642D67BC875945-001/shard-1-001
    [junit4] 2> 928829 INFO (TEST-CollectionsAPIDistributedZkTest.test-seed#[51642D67BC875945]) [ ] o.e.j.s.Server jetty-9.2.13.v20150730
    [junit4] 2> 928830 INFO (TEST-CollectionsAPIDistributedZkTest.test-seed#[51642D67BC875945]) [ ] o.e.j.s.h.ContextHandler Started o.e.j.s.ServletContextHandler@3fefdd8c{/nw/ji,null,AVAILABLE}
    [junit4] 2> 928831 INFO (TEST-CollectionsAPIDistributedZkTest.test-seed#[51642D67BC875945]) [ ] o.e.j.s.ServerConnector Started ServerConnector@47246f5{HTTP/1.1}{127.0.0.1:37616}
    [junit4] 2> 928831 INFO (TEST-CollectionsAPIDistributedZkTest.test-seed#[51642D67BC875945]) [ ] o.e.j.s.Server Started @930387ms
    [junit4] 2> 928831 INFO (TEST-CollectionsAPIDistributedZkTest.test-seed#[51642D67BC875945]) [ ] o.a.s.c.s.e.JettySolrRunner Jetty properties: {solrconfig=solrconfig.xml, coreRootDirectory=/home/jenkins/workspace/Lucene-Solr-5.5-Linux/solr/build/solr-core/test/J1/temp/solr.cloud.CollectionsAPIDistributedZkTest_51642D67BC875945-001/shard-1-001/cores, hostPort=37616, hostContext=/nw/ji, solr.data.dir=/home/jenkins/workspace/Lucene-Solr-5.5-Linux/solr/build/solr-core/test/J1/temp/solr.cloud.CollectionsAPIDistributedZkTest_51642D67BC875945-001/tempDir-001/jetty1}
    [junit4] 2> 928831 INFO (TEST-CollectionsAPIDistributedZkTest.test-seed#[51642D67BC875945]) [ ] o.a.s.s.SolrDispatchFilter SolrDispatchFilter.init(): sun.misc.Launcher$AppClassLoader@14327236
    [junit4] 2> 928831 INFO (TEST-CollectionsAPIDistributedZkTest.test-seed#[51642D67BC875945]) [ ] o.a.s.c.SolrResourceLoader new SolrResourceLoader for directory: '/home/jenkins/workspace/Lucene-Solr-5.5-Linux/solr/build/solr-core/test/J1/temp/solr.cloud.CollectionsAPIDistributedZkTest_51642D67BC875945-001/shard-1-001'
    [junit4] 2> 928831 INFO (TEST-CollectionsAPIDistributedZkTest.test-seed#[51642D67BC875945]) [ ] o.a.s.c.SolrResourceLoader JNDI not configured for solr (NoInitialContextEx)
    [junit4] 2> 928831 INFO (TEST-CollectionsAPIDistributedZkTest.test-seed#[51642D67BC875945]) [ ] o.a.s.c.SolrResourceLoader solr home defaulted to 'solr/' (could not find system property or JNDI)
    [junit4] 2> 928831 INFO (TEST-CollectionsAPIDistributedZkTest.test-seed#[51642D67BC875945]) [ ] o.a.s.c.c.SolrZkClient Using default ZkCredentialsProvider
    [junit4] 2> 928832 INFO (TEST-CollectionsAPIDistributedZkTest.test-seed#[51642D67BC875945]) [ ] o.a.s.c.c.ConnectionManager Waiting for client to connect to ZooKeeper
    [junit4] 2> 928832 INFO (zkCallback-1015-thread-1) [ ] o.a.s.c.c.ConnectionManager Watcher org.apache.solr.common.cloud.ConnectionManager@73199590 name:ZooKeeperConnection Watcher:127.0.0.1:51425/solr got event WatchedEvent state:SyncConnected type:None path:null path:null type:None
    [junit4] 2> 928832 INFO (TEST-CollectionsAPIDistributedZkTest.test-seed#[51642D67BC875945]) [ ] o.a.s.c.c.ConnectionManager Client is connected to ZooKeeper
    [junit4] 2> 928833 INFO (TEST-CollectionsAPIDistributedZkTest.test-seed#[51642D67BC875945]) [ ] o.a.s.c.c.SolrZkClient Using default ZkACLProvider
    [junit4] 2> 928833 INFO (TEST-CollectionsAPIDistributedZkTest.test-seed#[51642D67BC875945]) [ ] o.a.s.s.SolrDispatchFilter Loading solr.xml from SolrHome (not found in ZooKeeper)
    [junit4] 2> 928833 INFO (TEST-CollectionsAPIDistributedZkTest.test-seed#[51642D67BC875945]) [ ] o.a.s.c.SolrXmlConfig Loading container configuration from /home/jenkins/workspace/Lucene-Solr-5.5-Linux/solr/build/solr-core/test/J1/temp/solr.cloud.CollectionsAPIDistributedZkTest_51642D67BC875945-001/shard-1-001/solr.xml
    [junit4] 2> 928842 INFO (TEST-CollectionsAPIDistributedZkTest.test-seed#[51642D67BC875945]) [ ] o.a.s.c.CorePropertiesLocator Config-defined core root directory: /home/jenkins/workspace/Lucene-Solr-5.5-Linux/solr/build/solr-core/test/J1/temp/solr.cloud.CollectionsAPIDistributedZkTest_51642D67BC875945-001/shard-1-001/cores
    [junit4] 2> 928842 INFO (TEST-CollectionsAPIDistributedZkTest.test-seed#[51642D67BC875945]) [ ] o.a.s.c.CoreContainer New CoreContainer 68505848
    [junit4] 2> 928842 INFO (TEST-CollectionsAPIDistributedZkTest.test-seed#[51642D67BC875945]) [ ] o.a.s.c.CoreContainer Loading cores into CoreContainer [instanceDir=/home/jenkins/workspace/Lucene-Solr-5.5-Linux/solr/build/solr-core/test/J1/temp/solr.cloud.CollectionsAPIDistributedZkTest_51642D67BC875945-001/shard-1-001]
    [junit4] 2> 928842 WARN (TEST-CollectionsAPIDistributedZkTest.test-seed#[51642D67BC875945]) [ ] o.a.s.c.CoreContainer Couldn't add files from /home/jenkins/workspace/Lucene-Solr-5.5-Linux/solr/build/solr-core/test/J1/temp/solr.cloud.CollectionsAPIDistributedZkTest_51642D67BC875945-001/shard-1-001/lib to classpath: /home/jenkins/workspace/Lucene-Solr-5.5-Linux/solr/build/solr-core/test/J1/temp/solr.cloud.CollectionsAPIDistributedZkTest_51642D67BC875945-001/shard-1-001/lib
    [junit4] 2> 928842 INFO (TEST-CollectionsAPIDistributedZkTest.test-seed#[51642D67BC875945]) [ ] o.a.s.h.c.HttpShardHandlerFactory created with socketTimeout : 90000,urlScheme : ,connTimeout : 15000,maxConnectionsPerHost : 20,maxConnections : 10000,corePoolSize : 0,maximumPoolSize : 2147483647,maxThreadIdleTime : 5,sizeOfQueue : -1,fairnessPolicy : false,useRetries : false,
    [junit4] 2> 928843 INFO (TEST-CollectionsAPIDistributedZkTest.test-seed#[51642D67BC875945]) [ ] o.a.s.u.UpdateShardHandler Creating UpdateShardHandler HTTP client with params: socketTimeout=340000&connTimeout=45000&retry=true
    [junit4] 2> 928843 INFO (TEST-CollectionsAPIDistributedZkTest.test-seed#[51642D67BC875945]) [ ] o.a.s.l.LogWatcher SLF4J impl is org.slf4j.impl.Log4jLoggerFactory
    [junit4] 2> 928843 INFO (TEST-CollectionsAPIDistributedZkTest.test-seed#[51642D67BC875945]) [ ] o.a.s.l.LogWatcher Registering Log Listener [Log4j (org.slf4j.impl.Log4jLoggerFactory)]
    [junit4] 2> 928843 INFO (TEST-CollectionsAPIDistributedZkTest.test-seed#[51642D67BC875945]) [ ] o.a.s.c.ZkContainer Zookeeper client=127.0.0.1:51425/solr
    [junit4] 2> 928843 INFO (TEST-CollectionsAPIDistributedZkTest.test-seed#[51642D67BC875945]) [ ] o.a.s.c.ZkController zkHost includes chroot
    [junit4] 2> 928843 INFO (TEST-CollectionsAPIDistributedZkTest.test-seed#[51642D67BC875945]) [ ] o.a.s.c.c.SolrZkClient Using default ZkCredentialsProvider
    [junit4] 2> 928844 INFO (TEST-CollectionsAPIDistributedZkTest.test-seed#[51642D67BC875945]) [ ] o.a.s.c.c.ConnectionManager Waiting for client to connect to ZooKeeper
    [junit4] 2> 928845 INFO (zkCallback-1018-thread-1) [ ] o.a.s.c.c.ConnectionManager Watcher org.apache.solr.common.cloud.ConnectionManager@77107110 name:ZooKeeperConnection Watcher:127.0.0.1:51425 got event WatchedEvent state:SyncConnected type:None path:null path:null type:None
    [junit4] 2> 928845 INFO (TEST-CollectionsAPIDistributedZkTest.test-seed#[51642D67BC875945]) [ ] o.a.s.c.c.ConnectionManager Client is connected to ZooKeeper
    [junit4] 2> 928845 INFO (TEST-CollectionsAPIDistributedZkTest.test-seed#[51642D67BC875945]) [ ] o.a.s.c.c.SolrZkClient Using default ZkACLProvider
    [junit4] 2> 928846 INFO (TEST-CollectionsAPIDistributedZkTest.test-seed#[51642D67BC875945]) [n:127.0.0.1:37616_nw%2Fji ] o.a.s.c.c.ConnectionManager Waiting for client to connect to ZooKeeper
    [junit4] 2> 928847 INFO (zkCallback-1019-thread-1-processing-n:127.0.0.1:37616_nw%2Fji) [n:127.0.0.1:37616_nw%2Fji ] o.a.s.c.c.ConnectionManager Watcher org.apache.solr.common.cloud.ConnectionManager@5ab12594 name:ZooKeeperConnection Watcher:127.0.0.1:51425/solr got event WatchedEvent state:SyncConnected type:None path:null path:null type:None
    [junit4] 2> 928847 INFO (TEST-CollectionsAPIDistributedZkTest.test-seed#[51642D67BC875945]) [n:127.0.0.1:37616_nw%2Fji ] o.a.s.c.c.ConnectionManager Client is connected to ZooKeeper
    [junit4] 2> 928849 INFO (TEST-CollectionsAPIDistributedZkTest.test-seed#[51642D67BC875945]) [n:127.0.0.1:37616_nw%2Fji ] o.a.s.c.c.ZkStateReader Updating cluster state from ZooKeeper...
    [junit4] 2> 929852 INFO (TEST-CollectionsAPIDistributedZkTest.test-seed#[51642D67BC875945]) [n:127.0.0.1:37616_nw%2Fji ] o.a.s.c.ZkController Register node as live in ZooKeeper:/live_nodes/127.0.0.1:37616_nw%2Fji
    [junit4] 2> 929852 INFO (TEST-CollectionsAPIDistributedZkTest.test-seed#[51642D67BC875945]) [n:127.0.0.1:37616_nw%2Fji ] o.a.s.c.c.SolrZkClient makePath: /live_nodes/127.0.0.1:37616_nw%2Fji
    [junit4] 2> 929853 INFO (zkCallback-1014-thread-1) [ ] o.a.s.c.c.ZkStateReader A live node change: [WatchedEvent state:SyncConnected type:NodeChildrenChanged path:/live_nodes], has occurred - updating... (live nodes size: [1])
    [junit4] 2> 929853 INFO (zkCallback-1012-thread-1-processing-n:127.0.0.1:55455_nw%2Fji) [n:127.0.0.1:55455_nw%2Fji ] o.a.s.c.c.ZkStateReader A live node change: [WatchedEvent state:SyncConnected type:NodeChildrenChanged path:/live_nodes], has occurred - updating... (live nodes size: [1])
    [junit4] 2> 929853 INFO (zkCallback-1019-thread-1-processing-n:127.0.0.1:37616_nw%2Fji) [n:127.0.0.1:37616_nw%2Fji ] o.a.s.c.c.ZkStateReader A live node change: [WatchedEvent state:SyncConnected type:NodeChildrenChanged path:/live_nodes], has occurred - updating... (live nodes size: [1])
    [junit4] 2> 929855 INFO (TEST-CollectionsAPIDistributedZkTest.test-seed#[51642D67BC875945]) [n:127.0.0.1:37616_nw%2Fji ] o.a.s.c.Overseer Overseer (id=null) closing
    [junit4] 2> 929855 INFO (TEST-CollectionsAPIDistributedZkTest.test-seed#[51642D67BC875945]) [n:127.0.0.1:37616_nw%2Fji ] o.a.s.c.LeaderElector Joined leadership election with path: /overseer_elect/election/95486761079144456-127.0.0

[...truncated too long message...]

t, HdfsBasicDistributedZkTest, TestNonDefinedSimilarityFactory, CollectionsAPIDistributedZkTest]
    [junit4] 2> NOTE: reproduce with: ant test -Dtestcase=CollectionsAPIDistributedZkTest -Dtests.seed=51642D67BC875945 -Dtests.multiplier=3 -Dtests.slow=true -Dtests.locale=he-IL -Dtests.timezone=Asia/Chongqing -Dtests.asserts=true -Dtests.file.encoding=ISO-8859-1
    [junit4] ERROR 0.00s J1 | CollectionsAPIDistributedZkTest (suite) <<<
    [junit4] > Throwable #1: com.carrotsearch.randomizedtesting.ThreadLeakError: 5 threads leaked from SUITE scope at org.apache.solr.cloud.CollectionsAPIDistributedZkTest:
    [junit4] > 1) Thread[id=6815, name=TEST-CollectionsAPIDistributedZkTest.test-seed#[51642D67BC875945]-SendThread(127.0.0.1:51425), state=TIMED_WAITING, group=TGRP-CollectionsAPIDistributedZkTest]
    [junit4] > at java.lang.Thread.sleep(Native Method)
    [junit4] > at org.apache.zookeeper.client.StaticHostProvider.next(StaticHostProvider.java:101)
    [junit4] > at org.apache.zookeeper.ClientCnxn$SendThread.startConnect(ClientCnxn.java:940)
    [junit4] > at org.apache.zookeeper.ClientCnxn$SendThread.run(ClientCnxn.java:1003)
    [junit4] > 2) Thread[id=12064, name=zkCallback-1042-thread-2, state=TIMED_WAITING, group=TGRP-CollectionsAPIDistributedZkTest]
    [junit4] > at sun.misc.Unsafe.park(Native Method)
    [junit4] > at java.util.concurrent.locks.LockSupport.parkNanos(LockSupport.java:226)
    [junit4] > at java.util.concurrent.SynchronousQueue$TransferStack.awaitFulfill(SynchronousQueue.java:460)
    [junit4] > at java.util.concurrent.SynchronousQueue$TransferStack.transfer(SynchronousQueue.java:359)
    [junit4] > at java.util.concurrent.SynchronousQueue.poll(SynchronousQueue.java:942)
    [junit4] > at java.util.concurrent.ThreadPoolExecutor.getTask(ThreadPoolExecutor.java:1068)
    [junit4] > at java.util.concurrent.ThreadPoolExecutor.runWorker(ThreadPoolExecutor.java:1130)
    [junit4] > at java.util.concurrent.ThreadPoolExecutor$Worker.run(ThreadPoolExecutor.java:615)
    [junit4] > at java.lang.Thread.run(Thread.java:745)
    [junit4] > 3) Thread[id=6817, name=zkCallback-1042-thread-1, state=TIMED_WAITING, group=TGRP-CollectionsAPIDistributedZkTest]
    [junit4] > at sun.misc.Unsafe.park(Native Method)
    [junit4] > at java.util.concurrent.locks.LockSupport.parkNanos(LockSupport.java:226)
    [junit4] > at java.util.concurrent.SynchronousQueue$TransferStack.awaitFulfill(SynchronousQueue.java:460)
    [junit4] > at java.util.concurrent.SynchronousQueue$TransferStack.transfer(SynchronousQueue.java:359)
    [junit4] > at java.util.concurrent.SynchronousQueue.poll(SynchronousQueue.java:942)
    [junit4] > at java.util.concurrent.ThreadPoolExecutor.getTask(ThreadPoolExecutor.java:1068)
    [junit4] > at java.util.concurrent.ThreadPoolExecutor.runWorker(ThreadPoolExecutor.java:1130)
    [junit4] > at java.util.concurrent.ThreadPoolExecutor$Worker.run(ThreadPoolExecutor.java:615)
    [junit4] > at java.lang.Thread.run(Thread.java:745)
    [junit4] > 4) Thread[id=6816, name=TEST-CollectionsAPIDistributedZkTest.test-seed#[51642D67BC875945]-EventThread, state=WAITING, group=TGRP-CollectionsAPIDistributedZkTest]
    [junit4] > at sun.misc.Unsafe.park(Native Method)
    [junit4] > at java.util.concurrent.locks.LockSupport.park(LockSupport.java:186)
    [junit4] > at java.util.concurrent.locks.AbstractQueuedSynchronizer$ConditionObject.await(AbstractQueuedSynchronizer.java:2043)
    [junit4] > at java.util.concurrent.LinkedBlockingQueue.take(LinkedBlockingQueue.java:442)
    [junit4] > at org.apache.zookeeper.ClientCnxn$EventThread.run(ClientCnxn.java:494)
    [junit4] > 5) Thread[id=12091, name=zkCallback-1042-thread-3, state=TIMED_WAITING, group=TGRP-CollectionsAPIDistributedZkTest]
    [junit4] > at sun.misc.Unsafe.park(Native Method)
    [junit4] > at java.util.concurrent.locks.LockSupport.parkNanos(LockSupport.java:226)
    [junit4] > at java.util.concurrent.SynchronousQueue$TransferStack.awaitFulfill(SynchronousQueue.java:460)
    [junit4] > at java.util.concurrent.SynchronousQueue$TransferStack.transfer(SynchronousQueue.java:359)
    [junit4] > at java.util.concurrent.SynchronousQueue.poll(SynchronousQueue.java:942)
    [junit4] > at java.util.concurrent.ThreadPoolExecutor.getTask(ThreadPoolExecutor.java:1068)
    [junit4] > at java.util.concurrent.ThreadPoolExecutor.runWorker(ThreadPoolExecutor.java:1130)
    [junit4] > at java.util.concurrent.ThreadPoolExecutor$Worker.run(ThreadPoolExecutor.java:615)
    [junit4] > at java.lang.Thread.run(Thread.java:745)
    [junit4] > at __randomizedtesting.SeedInfo.seed([51642D67BC875945]:0)Throwable #2: com.carrotsearch.randomizedtesting.ThreadLeakError: There are still zombie threads that couldn't be terminated:
    [junit4] > 1) Thread[id=12064, name=zkCallback-1042-thread-2, state=TIMED_WAITING, group=TGRP-CollectionsAPIDistributedZkTest]
    [junit4] > at sun.misc.Unsafe.park(Native Method)
    [junit4] > at java.util.concurrent.locks.LockSupport.parkNanos(LockSupport.java:226)
    [junit4] > at java.util.concurrent.SynchronousQueue$TransferStack.awaitFulfill(SynchronousQueue.java:460)
    [junit4] > at java.util.concurrent.SynchronousQueue$TransferStack.transfer(SynchronousQueue.java:359)
    [junit4] > at java.util.concurrent.SynchronousQueue.poll(SynchronousQueue.java:942)
    [junit4] > at java.util.concurrent.ThreadPoolExecutor.getTask(ThreadPoolExecutor.java:1068)
    [junit4] > at java.util.concurrent.ThreadPoolExecutor.runWorker(ThreadPoolExecutor.java:1130)
    [junit4] > at java.util.concurrent.ThreadPoolExecutor$Worker.run(ThreadPoolExecutor.java:615)
    [junit4] > at java.lang.Thread.run(Thread.java:745)
    [junit4] > 2) Thread[id=6817, name=zkCallback-1042-thread-1, state=TIMED_WAITING, group=TGRP-CollectionsAPIDistributedZkTest]
    [junit4] > at sun.misc.Unsafe.park(Native Method)
    [junit4] > at java.util.concurrent.locks.LockSupport.parkNanos(LockSupport.java:226)
    [junit4] > at java.util.concurrent.SynchronousQueue$TransferStack.awaitFulfill(SynchronousQueue.java:460)
    [junit4] > at java.util.concurrent.SynchronousQueue$TransferStack.transfer(SynchronousQueue.java:359)
    [junit4] > at java.util.concurrent.SynchronousQueue.poll(SynchronousQueue.java:942)
    [junit4] > at java.util.concurrent.ThreadPoolExecutor.getTask(ThreadPoolExecutor.java:1068)
    [junit4] > at java.util.concurrent.ThreadPoolExecutor.runWorker(ThreadPoolExecutor.java:1130)
    [junit4] > at java.util.concurrent.ThreadPoolExecutor$Worker.run(ThreadPoolExecutor.java:615)
    [junit4] > at java.lang.Thread.run(Thread.java:745)
    [junit4] > 3) Thread[id=12091, name=zkCallback-1042-thread-3, state=TIMED_WAITING, group=TGRP-CollectionsAPIDistributedZkTest]
    [junit4] > at sun.misc.Unsafe.park(Native Method)
    [junit4] > at java.util.concurrent.locks.LockSupport.parkNanos(LockSupport.java:226)
    [junit4] > at java.util.concurrent.SynchronousQueue$TransferStack.awaitFulfill(SynchronousQueue.java:460)
    [junit4] > at java.util.concurrent.SynchronousQueue$TransferStack.transfer(SynchronousQueue.java:359)
    [junit4] > at java.util.concurrent.SynchronousQueue.poll(SynchronousQueue.java:942)
    [junit4] > at java.util.concurrent.ThreadPoolExecutor.getTask(ThreadPoolExecutor.java:1068)
    [junit4] > at java.util.concurrent.ThreadPoolExecutor.runWorker(ThreadPoolExecutor.java:1130)
    [junit4] > at java.util.concurrent.ThreadPoolExecutor$Worker.run(ThreadPoolExecutor.java:615)
    [junit4] > at java.lang.Thread.run(Thread.java:745)
    [junit4] > 4) Thread[id=6815, name=TEST-CollectionsAPIDistributedZkTest.test-seed#[51642D67BC875945]-SendThread(127.0.0.1:51425), state=TIMED_WAITING, group=TGRP-CollectionsAPIDistributedZkTest]
    [junit4] > at java.lang.Thread.sleep(Native Method)
    [junit4] > at org.apache.zookeeper.ClientCnxn$SendThread.run(ClientCnxn.java:994)
    [junit4] > at __randomizedtesting.SeedInfo.seed([51642D67BC875945]:0)
    [junit4] Completed [293/566 (1!)] on J1 in 101.98s, 1 test, 3 errors <<< FAILURES!

[...truncated 841 lines...]
BUILD FAILED
/home/jenkins/workspace/Lucene-Solr-5.5-Linux/build.xml:750: The following error occurred while executing this line:
/home/jenkins/workspace/Lucene-Solr-5.5-Linux/build.xml:694: The following error occurred while executing this line:
/home/jenkins/workspace/Lucene-Solr-5.5-Linux/build.xml:59: The following error occurred while executing this line:
/home/jenkins/workspace/Lucene-Solr-5.5-Linux/solr/build.xml:233: The following error occurred while executing this line:
/home/jenkins/workspace/Lucene-Solr-5.5-Linux/solr/common-build.xml:534: The following error occurred while executing this line:
/home/jenkins/workspace/Lucene-Solr-5.5-Linux/lucene/common-build.xml:1477: The following error occurred while executing this line:
/home/jenkins/workspace/Lucene-Solr-5.5-Linux/lucene/common-build.xml:1033: There were test failures: 566 suites (7 ignored), 2277 tests, 2 suite-level errors, 1 error, 934 ignored (38 assumptions) [seed: 51642D67BC875945]

Total time: 40 minutes 24 seconds
Build step 'Invoke Ant' marked build as failure
Archiving artifacts
[WARNINGS] Skipping publisher since build result is FAILURE
Recording test results
Email was triggered for: Failure - Any
Sending email for trigger: Failure - Any

Search Discussions

Related Discussions

Discussion Navigation
viewthread | post
Discussion Overview
groupdev @
categorieslucene
postedMar 3, '16 at 1:42p
activeMar 3, '16 at 1:42p
posts1
users1
websitelucene.apache.org

1 user in discussion

Policeman Jenkins Server: 1 post

People

Translate

site design / logo © 2018 Grokbase